program: Gaussian 09
title: 000078651
version: EM64L-G09RevD.01
frameworkgroup: C1[X(C14H13NO)]
method: RPBEPBE
basis: SDD
operation: Freq
keyword: #p
keyword: freq=noraman
keyword: PBEPBE/SDD
title: #p freq=noraman PBEPBE/SDD
converged: YES YES NO NO
title: Mulliken charges:
elementType: O N C C C C C C C C C C C C C C H H H H H H H H H H H H H
charge: -0.310027 -0.680374 0.146922 0.336569 0.504320 0.057779 -0.341241 -0.633909 0.296767 -0.421562 -0.811845 -0.385916 -0.369490 -0.235868 -0.231630 -0.233616 0.263366 0.223791 0.231792 0.224401 0.233096 0.232412 0.271132 0.264589 0.380066 0.299154 0.229369 0.229512 0.230441
chargesum: 0.00000
title: Mulliken charges with hydrogens summed into heavy atoms:
elementType: O N C C C C C C C C C C C C C C
charge: -0.310027 -0.001154 0.146922 0.336569 0.504320 0.057779 -0.077875 -0.410118 0.296767 -0.189769 -0.121937 -0.114784 -0.104901 -0.006499 -0.002118 -0.003175
polarizability: 2.55362765e+02 1.83097579e+00 1.71906064e+02 1.06692607e+01 -4.48011449e+00 8.73754069e+01
1716.lowfreq: -6.4539 -2.3846 0.0003 0.0006 0.0009 5.6476 43.4015 62.0633 74.7628
frequency: 43.3257 62.0125 74.7447 84.6363 117.1504 185.9674 214.7917 229.3420 253.9967 288.6535 311.3164 378.5717 405.2425 418.0422 451.7802 464.1603 494.9836 530.5564 567.8145 588.4635 601.8900 614.7121 676.0487 690.1264 704.8740 729.7502 745.6078 790.9033 804.5666 824.8919 858.5984 865.9005 886.7300 936.1113 955.7263 966.4371 985.1115 989.0576 999.6418 1001.8888 1026.6841 1044.8623 1076.5803 1082.5872 1139.1647 1173.0296 1173.3469 1189.5322 1195.9973 1278.4719 1306.9300 1318.7539 1323.3531 1378.8235 1395.1964 1399.6907 1415.0728 1433.3126 1465.7817 1467.5024 1477.2225 1495.6506 1507.6307 1558.5359 1584.2043 1590.0718 1607.3200 1635.8843 2977.0608 3055.3478 3087.5148 3114.3237 3125.3065 3131.5336 3135.5331 3147.8425 3157.1615 3162.2647 3168.1925 3318.7427 3630.9093
redmass: 4.0949 4.0855 1.6784 1.8093 4.7837 4.7369 3.8654 4.3192 5.3317 4.1409 2.9574 8.6955 2.8264 4.1132 2.6603 3.0405 1.2712 5.0924 5.1142 3.9086 5.8456 6.4171 4.1410 4.9724 1.6267 5.2470 2.2257 1.7802 1.2617 1.7515 1.2539 1.5170 4.3208 1.4723 2.9011 1.3379 1.3717 5.7216 1.3316 1.6059 2.2691 1.5746 1.6932 1.5931 2.2649 1.1817 1.3622 1.1352 1.8993 1.9304 2.1782 1.4577 2.5697 7.8533 1.2371 4.6417 4.2124 2.2814 1.3259 1.0550 2.2717 2.7887 3.3455 3.8193 3.9300 1.8313 6.0345 6.5338 1.0373 1.0971 1.0991 1.0911 1.0848 1.0880 1.0883 1.0930 1.0962 1.0953 1.1007 1.0601 1.0911
irintensity: 1.9443 0.7341 0.3708 1.1117 0.6521 0.5028 3.2828 0.9272 0.2426 2.2355 1.6406 4.6413 1.0429 6.1977 31.2279 4.7320 108.5049 9.0645 4.6950 1.3049 15.9204 1.1168 17.2771 9.4923 73.2772 4.5983 10.6630 54.8833 138.6240 7.4830 4.5050 11.5536 37.8056 3.3205 9.7174 1.8287 2.3341 1.0311 0.8071 11.1015 7.4156 15.8602 14.7111 10.3862 5.6082 3.5622 9.8792 9.8703 0.8972 122.5394 195.7575 18.3072 74.4363 4.1882 15.0250 32.2420 22.0680 23.6524 28.1594 13.2763 1.4899 25.5937 187.9113 40.8934 115.2917 199.3732 6.3833 229.8525 30.2762 18.4445 20.1049 28.5562 0.6579 7.4966 9.3848 24.4176 16.2461 10.1015 22.5740 112.7422 55.2050
temp: 298.150 k
press: 1.00000 atm
elementType: 8 7 6 6 6 6 6 6 6 6 6 6 6 6 6 6 1 1 1 1 1 1 1 1 1 1 1 1 1
symmnumber: 1
zpe: 608582.5 jmol-1
zpe.correction: 0.231797 hartree
zpe.thermalcorrener: 0.245602 hartree
zpe.thermalcorrenthalpy: 0.246546 hartree
zpe.thermalcorrgfe: 0.190781 hartree
zpe.sumelectzpe: -670.168178 hartree
zpe.sumelectthermal: -670.154372 hartree
zpe.sumelectthermalent: -670.153428 hartree
zpe.sumelectthermalfe: -670.209194 hartree
dipole: 1.8222 -1.7030 0.2387
dipole: 2.5055
quadrupole: -73.4934 -87.8746 -96.2504
quadrupole: 7.2893 3.5168 -0.9214
quadrupole: 12.3794 -2.0018 -10.3776 7.2893 3.5168 -0.9214
hfenergy: -670.3999745 hartree
pointgroup: C01 [X(C14H13N1O1)]
dipole: 0.7784654 -0.5698902 -0.2021454 debye
polarizability: 252.7687407|-0.5970168|152.3526288|21.1925167|36.5597867|109.5228668 unknown
InChI: InChI=1S/C14H13NO/c1-10-7-8-12(13(15)9-10)14(16)11-5-3-2-4-6-11/h2-9H,15H2,1H3
charge 0 multiplicity 1
29 atoms
O  -0.898424 1.854965 1.335424
N  1.630847 1.951241 2.02611
C  0.735279 0.346553 0.390878
C  1.843292 0.938558 1.11792
C  3.435894 -0.538105 -0.076913
C  -0.646867 0.78994 0.647123
C  1.042822 -0.638483 -0.600071
C  3.168806 0.453468 0.878975
C  -1.832014 0.012273 0.134725
C  2.350158 -1.073343 -0.83916
C  4.850457 -1.028578 -0.322135
C  -1.894918 -1.406848 0.168285
C  -2.973187 0.742283 -0.292498
C  -3.069073 -2.079067 -0.237833
C  -4.13718 0.070032 -0.717395
C  -4.188362 -1.344646 -0.693038
H  0.226791 -1.038635 -1.209129
H  3.996594 0.89176 1.45137
H  2.54991 -1.819625 -1.616165
H  5.585285 -0.495766 0.304796
H  4.937216 -2.109818 -0.103163
H  5.140254 -0.890181 -1.38071
H  -1.042853 -1.981321 0.546366
H  -2.929537 1.836107 -0.274555
H  0.668075 2.316563 2.095988
H  2.404957 2.334618 2.563335
H  -3.112088 -3.172999 -0.192279
H  -5.005409 0.644344 -1.059075
H  -5.095624 -1.868289 -1.014879
