program: Gaussian 09
title: 000078644
version: EM64L-G09RevD.01
frameworkgroup: C1[X(C13H11NO2)]
method: RPBEPBE
basis: SDD
operation: Freq
keyword: #p
keyword: freq=noraman
keyword: PBEPBE/SDD
title: #p freq=noraman PBEPBE/SDD
converged: YES YES NO YES
title: Mulliken charges:
elementType: O O N C C C C C C C C C C C C C H H H H H H H H H H H
charge: -0.369325 -0.232185 -0.456812 0.482692 -0.439610 -0.345013 0.421253 -0.195519 -0.213108 -0.352785 -0.352710 -0.255516 0.216434 -0.197582 -0.197603 -0.238955 0.223005 0.297107 0.334247 0.227463 0.227876 0.247705 0.247700 0.229871 0.230151 0.230151 0.231067
chargesum: 0.00000
title: Mulliken charges with hydrogens summed into heavy atoms:
elementType: O O N C C C C C C C C C C C C C
charge: -0.369325 -0.232185 -0.122565 0.482692 -0.216604 -0.047906 0.421253 0.031944 0.014768 -0.105080 -0.105010 -0.025645 0.216434 0.032569 0.032548 -0.007888
polarizability: 2.42412707e+02 -1.13748872e+01 1.16817228e+02 2.69580179e-02 9.20812335e-03 1.02570845e+02
1716.lowfreq: -38.1692 -7.6119 -0.0007 0.0002 0.0007 5.2692 13.8572 29.0282 54.5965
frequency: -38.1686 28.5606 54.5712 59.6820 88.3332 153.5146 223.6518 248.8184 267.0157 338.9037 383.8451 408.2064 408.5169 480.4972 509.8170 509.8638 610.3162 612.8254 629.0732 644.2373 671.7741 690.7301 692.7894 697.7194 767.1856 776.8604 780.1434 833.8040 842.2777 857.5176 914.9949 915.7667 939.0494 967.6867 972.6949 985.1266 989.4160 992.4755 997.1159 1018.6887 1028.3337 1073.6684 1089.9120 1135.0458 1163.4060 1171.2893 1173.4002 1186.4606 1190.3527 1260.5097 1302.9817 1325.8187 1383.9998 1385.8238 1433.5851 1440.3495 1471.5637 1486.0845 1516.3274 1600.6355 1604.1777 1605.1493 1618.7815 1693.1984 3114.5881 3132.7379 3133.8314 3142.8597 3145.7399 3156.9728 3166.3440 3166.5740 3175.4466 3188.5760 3540.5065
redmass: 4.4413 5.5056 5.6625 6.0114 5.4430 5.5756 6.0860 4.2109 6.1519 6.4208 6.1864 2.9253 2.8613 3.7190 2.8627 7.4534 6.4785 6.3222 6.4548 1.4661 5.6008 3.2422 1.8333 2.2005 1.6649 5.1242 2.1073 1.2468 1.2629 5.4043 1.4283 1.5269 7.5335 1.3780 1.3549 6.1883 5.3633 1.3720 1.3036 2.0892 2.1250 1.4982 1.5686 4.0401 1.4286 1.0559 1.0503 2.0956 1.1317 2.0611 1.3263 1.3999 10.0855 6.9804 2.3274 2.2111 2.2831 2.1952 2.2601 5.7727 5.6569 6.8971 6.0689 9.6354 1.0885 1.0850 1.0869 1.0891 1.0935 1.0933 1.0995 1.0968 1.1012 1.0955 1.0761
irintensity: 0.3838 1.2781 0.9454 1.4961 1.5317 3.8906 1.0331 2.4297 7.9166 1.6052 3.0329 0.0003 0.0103 15.7886 25.6893 7.1718 0.0224 0.8489 4.2854 20.2372 1.6114 14.6765 40.3990 71.4536 106.2171 12.4221 64.1048 0.0342 0.3795 9.7440 13.3520 7.0607 273.7580 0.0872 0.0364 0.8864 2.5949 0.9345 2.0750 32.8361 0.1321 11.5893 54.2378 666.1253 21.9498 0.0333 0.5155 82.9792 0.2933 2.6726 0.1304 47.5893 0.7716 59.7763 154.2470 4.2773 131.9746 10.9861 467.9044 41.0596 1.6229 5.8173 93.0701 272.2358 13.6404 0.4337 0.5300 8.9777 30.2077 30.5375 23.1701 16.9656 6.4096 5.9112 33.1870
temp: 298.150 k
press: 1.00000 atm
elementType: 8 8 7 6 6 6 6 6 6 6 6 6 6 6 6 6 1 1 1 1 1 1 1 1 1 1 1
symmnumber: 1
zpe: 546508.6 jmol-1
zpe.correction: 0.208154 hartree
zpe.thermalcorrener: 0.220580 hartree
zpe.thermalcorrenthalpy: 0.221525 hartree
zpe.thermalcorrgfe: 0.167697 hartree
zpe.sumelectzpe: -706.077397 hartree
zpe.sumelectthermal: -706.064971 hartree
zpe.sumelectthermalent: -706.064027 hartree
zpe.sumelectthermalfe: -706.117854 hartree
dipole: 0.0001 -1.9893 0.0023
dipole: 1.9893
quadrupole: -73.2752 -91.3322 -89.6248
quadrupole: -4.0534 0.0066 0.0080
quadrupole: 11.4689 -6.5881 -4.8808 -4.0534 0.0066 0.0080
hfenergy: -706.2855515 hartree
pointgroup: C01 [X(C13H11N1O2)]
dipole: -0.0023943 -0.7826431 0.0002707 debye
polarizability: 242.4795429|10.9995409|116.7503309|0.0128378|-0.0305676|102.570906 unknown
InChI: InChI=1S/C13H11NO2/c15-13(14-11-7-3-1-4-8-11)16-12-9-5-2-6-10-12/h1-10,14H
charge 0 multiplicity 1
27 atoms
O  1.111784 -0.929899 0.000803
O  0.169463 1.251764 -0.000258
N  -1.13232 -0.734698 0.000672
C  -2.47338 -0.257413 0.000269
C  -3.509319 -1.229513 0.000488
C  -2.799186 1.124457 -0.000302
C  2.447668 -0.413854 0.0004
C  -4.85938 -0.825237 0.000142
C  -4.156701 1.511114 -0.000643
C  3.09895 -0.202898 1.231166
C  3.098149 -0.202549 -1.230731
C  -5.192819 0.549396 -0.000426
C  0.030863 0.010655 0.000477
C  4.444054 0.230002 1.224693
C  4.443252 0.230358 -1.225016
C  5.117539 0.44654 -0.00035
H  -3.257573 -2.29783 0.000928
H  -2.000247 1.868881 -0.00047
H  -0.992935 -1.747694 0.001144
H  -5.649406 -1.584155 0.000316
H  -4.403414 2.578735 -0.001086
H  2.559751 -0.375162 2.16784
H  2.558342 -0.374541 -2.167106
H  -6.241603 0.864063 -0.000697
H  4.962897 0.398354 2.174536
H  4.961471 0.398984 -2.175151
H  6.160198 0.781939 -0.000641
