program: Gaussian 09
title: 000078637
version: EM64L-G09RevD.01
frameworkgroup: C1[X(C8H10N2O3)]
method: RPBEPBE
basis: SDD
operation: Freq
keyword: #p
keyword: freq=noraman
keyword: PBEPBE/SDD
title: #p freq=noraman PBEPBE/SDD
converged: YES YES NO NO
title: Mulliken charges:
elementType: O O O N N C C C C C C C C H H H H H H H H H H
charge: -0.460825 -0.226555 -0.274370 -0.387295 0.019858 0.336144 -0.338147 0.216805 -0.329661 -0.346820 -0.335327 -0.230944 -0.237425 0.243178 0.206065 0.378554 0.241249 0.203673 0.210035 0.283743 0.229964 0.237310 0.360788
chargesum: 0.00000
title: Mulliken charges with hydrogens summed into heavy atoms:
elementType: O O O N N C C C C C C C C
charge: -0.100037 -0.226555 -0.274370 -0.008740 0.019858 0.336144 0.111097 0.216805 -0.088411 0.066888 -0.051584 -0.000980 -0.000115
polarizability: 1.62337418e+02 -4.66067423e-01 1.47931035e+02 1.49149726e+00 9.39069933e-01 5.48166057e+01
1716.lowfreq: -2.6880 -0.0005 -0.0004 0.0002 9.5776 11.8966 41.4997 64.8763 82.3799
frequency: 41.4155 64.8728 82.3776 122.8258 132.9802 174.9768 252.1534 267.9330 272.6851 301.4249 377.6864 394.9713 426.8813 475.2982 521.1936 541.9637 610.5312 651.1099 659.6730 720.6944 761.6571 770.2523 795.3853 820.7539 843.0974 880.8516 926.5899 965.8232 985.4864 1031.5345 1041.9427 1053.2741 1064.1356 1107.9636 1149.7091 1161.5921 1190.8730 1199.5560 1217.7224 1250.1844 1275.5440 1300.4130 1349.2588 1367.6496 1387.1669 1407.8802 1442.3321 1463.8659 1473.4859 1477.8525 1517.5957 1574.8065 1629.2878 2956.0626 2958.8279 3013.7429 3025.4146 3136.6031 3160.9890 3170.9817 3185.4932 3346.7001 3591.7317
redmass: 4.5958 6.0266 6.1603 3.5472 4.3887 4.7056 3.4189 1.9921 2.2156 2.4532 5.3418 9.1306 3.6115 3.1722 3.1747 5.5166 5.1998 7.1112 4.8417 4.3706 1.3762 4.9725 1.3983 2.3698 1.4538 2.8917 2.4911 1.3458 1.3134 2.9647 2.5210 2.1432 2.5091 2.6607 1.6560 1.3805 1.4086 1.9706 1.1839 1.4944 1.2077 3.1307 1.8258 1.8332 2.4830 1.5005 3.0637 1.1117 1.1533 1.9758 3.7190 4.5960 6.7154 1.0548 1.0642 1.1029 1.1028 1.0870 1.0895 1.0946 1.0983 1.0779 1.0669
irintensity: 1.2842 1.2724 1.0291 7.1861 3.4772 14.1829 10.2545 51.5301 72.9277 25.4241 14.7168 2.3818 0.3061 6.8290 15.2015 0.9492 6.4816 7.6173 14.2325 3.4832 114.3044 8.6102 54.2283 2.5666 1.9374 42.3306 0.1410 2.8949 0.2255 63.2662 27.4733 8.8119 3.7505 19.4677 10.7311 103.2658 69.3132 162.9409 16.2332 58.3906 46.7535 167.8918 60.2618 5.6143 17.2924 0.9110 6.8154 49.4800 12.6394 0.9918 153.0444 146.6526 176.2569 47.1563 55.9369 67.4978 47.4856 8.3007 14.0367 8.7324 10.9822 72.6181 9.6132
temp: 298.150 k
press: 1.00000 atm
elementType: 8 8 8 7 7 6 6 6 6 6 6 6 6 1 1 1 1 1 1 1 1 1 1
symmnumber: 1
zpe: 463706.8 jmol-1
zpe.correction: 0.176617 hartree
zpe.thermalcorrener: 0.188685 hartree
zpe.thermalcorrenthalpy: 0.189629 hartree
zpe.thermalcorrgfe: 0.137533 hartree
zpe.sumelectzpe: -644.968297 hartree
zpe.sumelectthermal: -644.956228 hartree
zpe.sumelectthermalent: -644.955284 hartree
zpe.sumelectthermalfe: -645.007380 hartree
dipole: 3.2214 -5.5114 1.3600
dipole: 6.5270
quadrupole: -56.9737 -81.0579 -79.1367
quadrupole: 5.8100 6.2186 0.3824
quadrupole: 15.4157 -8.6685 -6.7472 5.8100 6.2186 0.3824
hfenergy: -645.1449134 hartree
pointgroup: C01 [X(C8H10N2O3)]
dipole: 1.2469743 2.1503304 -0.6445383 debye
dipolederiv: -0.5406622 -0.0302204 -0.231279 0.0199096 -0.5937558 0.1571123 -0.3077449 0.1879095 -0.4846849 -0.7145607 -0.4557895 0.0049929 -0.3454986 -0.9169537 0.0138504 -0.0103453 0.0057842 -0.246596 -0.6871473 0.4166827 -0.0274947 0.1213783 -0.5973378 0.0177983 -0.0174001 -0.0020432 -0.270519 -1.5236717 -0.1651355 0.0478381 0.2722725 -0.2771095 -0.0501578 0.2274842 0.0226945 -0.3882809 0.9897196 -0.0901478 0.0379629 0.2737953 1.9651931 -0.0506715 0.0336417 -0.0372119 0.1909998 1.3358106 0.0949418 -0.045518 -0.610815 0.1498822 0.0283422 -0.0258635 0.0002995 0.1593366 0.5555109 0.2495351 0.02218 0.4348146 0.2936045 0.0124268 -0.0302296 -0.0230685 0.3079732 -0.2737723 0.3869811 -0.0057773 -0.3107687 -0.9625502 0.0342923 0.0116409 0.0214747 -0.0263457 -0.4291858 -0.0773871 0.0226573 0.5881368 0.048814 -0.0145794 -0.0151237 -0.0095894 -0.229596 0.4086021 -0.0347012 0.1330004 -0.0966055 0.5175389 -0.1662096 0.103433 -0.1579106 0.425296 0.0350729 -0.5261592 0.0123804 0.0511676 0.3681418 -0.0144656 -0.0052448 -0.0145333 -0.0815617 0.4163227 0.3799273 -0.0235579 0.0408713 0.3371699 -0.0117147 -0.0078724 -0.0099076 -0.1007786 -0.0383676 -0.0972765 0.0028004 -0.1869163 -0.6543979 0.0175288 -0.0005445 0.0096237 -0.2102118 -0.0595115 -0.0342715 0.006495 -0.1742419 -0.0164903 -0.0699384 -0.0568537 -0.1199898 -0.0923916 0.0135003 0.0453044 -0.0479179 -0.0753479 -0.0620579 0.0979376 0.0182342 0.1185772 -0.0166026 0.326826 -0.0296827 0.0030673 -0.0030583 0.2237848 0.0057732 -0.0295804 0.0105268 0.3002656 -0.0137141 -0.1118562 -0.0014406 -0.0811217 0.01206 0.0020048 -0.002917 0.0034882 0.1646733 -0.1588808 -0.1323517 0.0192698 -0.1170336 -0.0988806 0.0685746 -0.0328635 0.0363416 0.0417009 0.0876393 0.0015661 -0.0561831 0.0525384 -0.0234329 -0.0721951 -0.0266129 -0.0173388 -0.1927923 0.087079 -0.0104375 0.00195 -0.0843971 0.0733801 0.0045751 0.0004311 0.0051591 0.1650827 0.0876274 0.0526466 -0.000123 0.0605492 -0.1045785 0.0033011 0.0024038 0.0055291 0.1501881 -0.0961455 0.051842 0.0020916 0.0458664 0.065761 0.0015391 0.0036776 0.0029988 0.1720707 0.1919085 0.1159899 0.1226054 0.1245046 0.2522152 -0.0151244 0.1682495 -0.038814 0.2627744 unknown
polarizability: 162.3101896|0.4887218|147.816946|-2.0899034|-3.5001703|54.9579233 unknown
InChI: InChI=1S/C8H10N2O3/c11-6-5-9-7-3-1-2-4-8(7)10(12)13/h1-4,9,11H,5-6H2
charge 0 multiplicity 1
23 atoms
O  3.867788 -0.590646 0.542485
O  -1.812874 -2.713474 0.064932
O  0.420537 -2.265341 0.118057
N  1.26488 0.217556 -0.037489
N  -0.832294 -1.868364 0.074485
C  -0.065606 0.551849 -0.006548
C  2.368961 1.177793 -0.07123
C  -1.11928 -0.441951 0.037826
C  -0.488191 1.926549 -0.02778
C  3.658404 0.45498 -0.46921
C  -2.489377 -0.065906 0.042927
C  -1.84231 2.277618 -0.021179
C  -2.860153 1.282527 0.011046
H  2.511261 1.659979 0.918865
H  2.172544 1.976657 -0.812876
H  1.488293 -0.780685 0.108882
H  0.269119 2.714977 -0.034127
H  4.497059 1.181287 -0.478769
H  3.544575 0.014767 -1.482043
H  -3.232836 -0.866773 0.073298
H  -2.118784 3.338003 -0.03437
H  -3.916321 1.566536 0.017425
H  4.583906 -1.210236 0.257895
