program: Gaussian 09
title: 000078628
version: EM64L-G09RevD.01
frameworkgroup: C1[X(C4H9NO4)]
method: RPBEPBE
basis: SDD
operation: Freq
keyword: #pfreq=noraman
keyword: PBEPBE/SDD
title: #p freq=noraman PBEPBE/SDD
converged: YES YES NO NO
title: Mulliken charges:
elementType: O O O O N C C C C H H H H H H H H H
charge: -0.327565 -0.436436 -0.446029 -0.277168 -0.122045 -0.307076 -0.319765 0.343275 -0.488675 0.234639 0.244515 0.247684 0.222577 0.361436 0.350579 0.229343 0.244458 0.246251
chargesum: 0.00000
title: Mulliken charges with hydrogens summed into heavy atoms:
elementType: O O O O N C C C C
charge: -0.327565 -0.075000 -0.095450 -0.277168 -0.122045 0.172078 0.150497 0.343275 0.231377
polarizability: 8.42068070e+01 8.91261996e-01 6.54003846e+01 6.06647594e-01 2.51967804e+00 4.77526365e+01
1716.lowfreq: -8.6523 -0.0008 -0.0007 0.0004 0.9939 9.6461 51.7674 69.2070 89.2502
frequency: 51.7561 69.1637 89.2377 91.5091 121.8318 162.3521 174.7211 216.6887 320.1497 345.4313 368.5342 439.9559 489.0689 612.4840 619.8761 706.8744 768.2015 912.4503 943.1345 951.8204 992.2664 1014.7956 1102.8614 1119.2815 1145.2332 1151.8070 1187.2949 1210.6470 1284.1940 1340.3499 1375.8369 1403.2712 1418.0356 1436.3782 1452.1720 1464.7061 1470.1817 1476.7863 1666.2745 2967.8739 3006.4969 3030.7101 3055.6850 3110.1201 3130.3924 3145.5652 3544.9378 3561.8314
redmass: 3.1495 3.4816 1.3389 3.3133 4.3233 2.6299 1.4924 2.8807 4.0202 3.5189 2.9665 3.3275 1.3817 4.0081 5.7323 10.4241 5.8221 5.2986 5.1585 3.6459 1.8418 3.0516 2.2766 1.2553 1.4807 1.5650 1.7425 1.2154 1.9105 1.2158 1.5562 1.3382 1.3004 1.2920 1.0504 1.1052 1.0569 1.0994 9.2243 1.0620 1.0293 1.0645 1.1022 1.1050 1.1027 1.1050 1.0653 1.0660
irintensity: 9.8873 3.8176 0.7151 10.8592 2.5417 24.8783 133.4753 2.7843 26.4126 6.4040 8.7738 40.2766 111.5603 34.3003 40.8942 19.9756 27.2446 10.5736 144.1788 216.6289 40.9757 34.6738 78.9178 0.6270 23.1759 152.6770 210.6317 36.5474 46.9523 16.3195 89.8753 50.7483 38.3314 77.6886 14.5980 22.7032 14.3078 21.0134 354.4563 65.3990 37.6040 39.8335 11.2811 25.4933 11.7745 15.7159 9.3782 4.3194
temp: 298.150 k
press: 1.00000 atm
elementType: 8 8 8 8 7 6 6 6 6 1 1 1 1 1 1 1 1 1
symmnumber: 1
zpe: 369174.9 jmol-1
zpe.correction: 0.140611 hartree
zpe.thermalcorrener: 0.151550 hartree
zpe.thermalcorrenthalpy: 0.152494 hartree
zpe.thermalcorrgfe: 0.103218 hartree
zpe.sumelectzpe: -512.713630 hartree
zpe.sumelectthermal: -512.702691 hartree
zpe.sumelectthermalent: -512.701747 hartree
zpe.sumelectthermalfe: -512.751023 hartree
dipole: 0.3517 0.0315 -0.1307
dipole: 0.3766
quadrupole: -35.5359 -62.9249 -54.8259
quadrupole: 6.6318 4.3283 2.3581
quadrupole: 15.5597 -11.8294 -3.7303 6.6318 4.3283 2.3581
hfenergy: -512.8542408 hartree
pointgroup: C01 [X(C4H9N1O4)]
dipole: 0.1330957 -0.0317932 0.0567726 debye
dipolederiv: -1.4065863 0.2042997 0.1271538 0.4786649 -0.6659436 -0.1433664 0.2230252 -0.1093753 -0.3637729 -0.2313153 0.1759311 -0.1000299 0.0361917 -0.9275738 -0.0224723 -0.080525 0.1767399 -0.6155848 -0.6103418 -0.0303028 -0.2358471 0.031606 -0.5432824 0.1875271 -0.416792 0.2805335 -0.526019 -0.7242891 -0.1869226 -0.0479032 -0.193306 -1.0063278 -0.221491 -0.0740768 -0.2577472 -0.4277106 -1.4489727 -0.1826944 -0.1156456 -0.0104588 -0.9415554 -0.0132278 0.0321952 -0.1933599 -0.4202469 0.3342694 -0.0559874 0.0958018 0.0722987 1.2683156 -0.0479833 0.1437906 -0.0776003 0.6076566 1.0492269 -0.3059418 0.1337236 -0.5298375 0.5196156 -0.2042913 0.1116069 -0.2213037 0.5974878 2.1526333 0.2125379 0.0330363 -0.0203476 1.3617713 0.3766294 -0.0427873 0.3682397 0.4291039 0.7798533 -0.0082443 -0.0352647 0.0774123 0.2174468 -0.0189174 -0.0035264 -0.019245 0.2746763 0.0558112 0.0360558 0.1220822 0.0049181 -0.0454826 0.0327605 0.0488373 0.0131014 -0.1193495 -0.0807752 -0.0135953 -0.058203 -0.0189568 0.0552583 0.0159749 0.0000868 0.0169216 0.0889472 0.0808681 -0.0362686 -0.0909379 0.0173118 -0.0344992 -0.0745113 -0.0607738 -0.0276168 -0.0213492 -0.1296318 -0.0231479 0.0718921 -0.0430273 -0.0038156 0.1398511 0.0174766 0.0990559 -0.0740867 0.0679811 -0.0080386 0.0008784 -0.018898 0.4190334 0.0459213 0.0024641 0.0348427 0.3235956 0.1339617 0.1595641 0.0759904 0.1715309 0.2811135 -0.0682062 0.1161706 -0.0928485 0.2321321 -0.0034261 0.0614213 0.0283995 0.1211393 -0.0348706 -0.0582538 0.0459702 -0.0539785 0.1010581 -0.0126904 -0.0036288 -0.0043319 -0.0767425 0.092217 -0.0426049 -0.084156 -0.0323921 -0.0936112 -0.0065762 0.0049626 -0.0007949 -0.0994992 -0.0114205 0.1166615 0.0210138 0.0960327 0.0070733 unknown
polarizability: 83.6428482|-3.3506902|65.6716017|1.343477|3.1642872|48.0453781 unknown
InChI: InChI=1S/C4H9NO4/c1-9-4(8)5(2-6)3-7/h6-7H,2-3H2,1H3
charge 0 multiplicity 1
18 atoms
O  1.594938 -0.470108 -0.192703
O  -0.524696 -2.419676 0.40822
O  -2.482648 1.221284 -0.746454
O  0.969906 1.653951 0.603255
N  -0.632161 0.003255 0.054251
C  -0.870563 -1.341718 -0.50677
C  -1.761765 0.806425 0.473855
C  0.651406 0.51489 0.184506
C  3.004118 -0.021359 -0.132756
H  -0.312815 -1.431478 -1.455757
H  -1.949145 -1.437084 -0.693923
H  -1.373882 1.677165 1.032453
H  -2.425789 0.192134 1.116441
H  0.464492 -2.436357 0.48717
H  -3.263533 1.777027 -0.492767
H  3.590142 -0.893338 -0.456625
H  3.26825 0.276537 0.895539
H  3.161745 0.83415 -0.810134
