program: Gaussian 09
title: 000078641
version: EM64L-G09RevD.01
frameworkgroup: C1[X(C15H13N3O)]
method: RPBEPBE
basis: SDD
operation: Freq
keyword: #p
keyword: freq=noraman
keyword: PBEPBE/SDD
title: #p freq=noraman PBEPBE/SDD
converged: NO YES NO NO
title: Mulliken charges:
elementType: O N N N C C C C C C C C C C C C C C C H H H H H H H H H H H H H
charge: -0.230680 -0.412903 -0.042945 -0.707116 0.264533 0.281282 -0.029403 0.315431 -0.595182 -0.392854 -0.568058 0.534210 0.100968 -0.435720 -0.368460 -0.379098 -0.238817 -0.231505 -0.240639 0.261596 0.319689 0.236023 0.262471 0.235529 0.226253 0.256853 0.272920 0.226686 0.227886 0.229113 0.312832 0.309103
chargesum: 0.00000
title: Mulliken charges with hydrogens summed into heavy atoms:
elementType: O N N N C C C C C C C C C C C C C C C
charge: -0.230680 -0.093214 -0.042945 -0.085181 0.264533 0.281282 -0.029403 0.315431 -0.333585 -0.156831 -0.070058 0.534210 0.100968 -0.209467 -0.111606 -0.106178 -0.012132 -0.003619 -0.011526
polarizability: 2.37873599e+02 9.56040278e+00 2.32578715e+02 -1.17092505e+01 1.22711736e+01 1.14952031e+02
1716.lowfreq: -5.1039 -0.0004 -0.0002 -0.0002 1.9424 6.3148 47.1096 59.6121 73.9542
frequency: 47.0987 59.5972 73.9534 79.9872 124.4367 152.4877 203.0590 224.8004 257.5881 294.1059 326.5000 349.8211 356.0518 361.0689 377.4295 394.8373 406.7722 412.5107 455.1320 476.9343 505.3517 515.2751 572.4633 585.2446 600.0826 616.3583 664.0930 675.3622 697.5313 701.2731 710.1534 744.5876 786.8885 809.8645 828.5834 857.2241 870.6240 886.8919 893.7814 937.0957 938.5873 944.4305 984.3190 985.9433 989.5651 1000.1523 1005.1116 1029.2190 1042.1733 1083.3343 1121.6606 1159.9265 1171.8637 1187.6624 1191.3130 1229.6282 1258.1360 1285.7422 1300.6633 1316.8395 1324.3162 1332.3794 1380.8511 1384.4119 1411.9697 1433.3717 1446.0008 1460.2335 1479.7955 1500.6885 1549.7228 1577.4321 1588.2738 1609.3986 1633.2518 1642.4909 1647.0429 2934.5831 3106.8664 3121.9879 3124.5135 3134.9427 3136.3209 3145.9007 3148.8883 3159.3921 3169.8028 3506.4783 3568.2691 3707.9610
redmass: 4.1986 5.0951 4.7909 6.1359 4.7081 4.9722 4.7728 4.9636 4.6093 4.4692 5.4938 5.3588 1.2484 2.8547 1.2194 4.4120 2.8570 3.3321 4.7105 3.6874 3.5111 4.0208 3.3954 4.8146 2.6124 6.1017 3.0396 3.6255 6.1880 1.7470 3.3341 3.0196 2.3362 1.8271 3.4455 1.2625 4.3341 2.0867 2.7674 1.4512 1.3895 4.0546 2.3537 1.6681 5.9110 1.3596 2.3326 2.0810 1.5251 1.5907 2.3198 1.4057 1.0556 1.1442 1.3337 2.1035 1.6877 3.3003 1.7634 1.4081 1.8440 2.5436 7.3848 4.3614 2.7002 2.2603 2.8583 1.1219 2.3430 3.5809 7.1865 6.7176 6.5560 6.1393 2.7355 4.1336 1.7214 1.0683 1.0932 1.0870 1.0848 1.0891 1.0906 1.0971 1.0931 1.0963 1.0994 1.0756 1.0450 1.1041
irintensity: 0.6992 0.6268 0.8609 0.2385 0.8191 3.0499 1.0748 2.5563 4.8109 8.3831 1.1236 11.8625 105.6173 2.7296 172.6947 13.7863 0.0633 0.7055 8.9055 2.1342 3.6751 2.4891 40.9601 0.9513 36.0159 0.6425 19.7764 12.6726 0.6190 48.6517 41.1278 27.5748 25.6769 33.0454 20.5179 5.2520 24.7564 10.7309 12.7280 2.1505 0.7046 7.6365 5.3337 6.1204 0.7398 1.3733 14.8082 10.5994 2.4810 10.3029 6.2226 2.0239 0.3605 17.0987 24.9453 23.9889 66.1427 27.9678 59.7373 3.8160 65.0162 36.7031 3.1356 8.2396 10.4013 11.7621 13.9466 8.0594 9.9327 160.8174 69.6170 8.4665 3.8855 0.3643 10.4108 780.7045 51.9769 38.0493 17.7504 11.9429 0.5780 10.7611 11.2450 18.3849 29.3132 20.2804 18.0141 23.2097 87.5200 22.0156
temp: 298.150 k
press: 1.00000 atm
elementType: 8 7 7 7 6 6 6 6 6 6 6 6 6 6 6 6 6 6 6 1 1 1 1 1 1 1 1 1 1 1 1 1
symmnumber: 1
zpe: 654876.0 jmol-1
zpe.correction: 0.249429 hartree
zpe.thermalcorrener: 0.264893 hartree
zpe.thermalcorrenthalpy: 0.265837 hartree
zpe.thermalcorrgfe: 0.206830 hartree
zpe.sumelectzpe: -817.568076 hartree
zpe.sumelectthermal: -817.552611 hartree
zpe.sumelectthermalent: -817.551667 hartree
zpe.sumelectthermalfe: -817.610675 hartree
dipole: 0.0814 7.9920 -0.7127
dipole: 8.0241
quadrupole: -98.6749 -110.0237 -107.6895
quadrupole: -12.3534 -2.1058 3.0116
quadrupole: 6.7878 -4.5610 -2.2268 -12.3534 -2.1058 3.0116
hfenergy: -817.8175046 hartree
pointgroup: C01 [X(C15H13N3O1)]
dipole: 0.0361232 -3.1441123 0.2819086 debye
polarizability: 237.9546055|-9.5166323|232.5708462|11.3775932|12.248911|114.8788936 unknown
InChI: InChI=1S/C15H13N3O/c16-11-6-7-13-12(8-11)15(17-9-14(19)18-13)10-4-2-1-3-5-10/h1-8,18H,9,16H2
charge 0 multiplicity 1
32 atoms
O  -2.640601 3.515285 -0.54622
N  -2.351405 1.226144 -0.819281
N  0.104997 1.909474 0.7738
N  -1.049435 -4.069386 0.785773
C  -0.701521 -0.377728 0.178094
C  -1.981151 -0.082974 -0.39088
C  0.344783 0.680592 0.354513
C  1.777695 0.347433 0.056873
C  -0.418566 -1.712255 0.569631
C  -2.903265 -1.143173 -0.596916
C  -1.280432 2.291493 1.12654
C  -1.349039 -2.766698 0.38511
C  -2.148203 2.430554 -0.133291
C  -2.600016 -2.462108 -0.229978
C  2.134558 -0.634552 -0.906699
C  2.810913 1.069065 0.71417
C  3.492062 -0.891041 -1.200838
C  4.165137 0.806512 0.425848
C  4.512479 -0.176242 -0.532656
H  0.55415 -1.927476 1.025889
H  -2.982173 1.30245 -1.6236
H  -3.880038 -0.918722 -1.041992
H  -1.262217 3.272007 1.623416
H  -1.761136 1.544022 1.796905
H  -3.333949 -3.258375 -0.40124
H  1.350714 -1.181991 -1.440522
H  2.523088 1.839022 1.436425
H  3.752434 -1.641258 -1.955922
H  4.951235 1.366602 0.944539
H  5.565629 -0.378021 -0.758796
H  -0.157478 -4.289411 1.218711
H  -1.723747 -4.819346 0.667891
