program: Gaussian 09
title: 000078630
version: EM64L-G09RevD.01
frameworkgroup: C1[X(C12H12N2)]
method: RPBEPBE
basis: SDD
operation: Freq
keyword: #pfreq=noraman
keyword: PBEPBE/SDD
title: #p freq=noraman PBEPBE/SDD
converged: NO YES NO YES
title: Mulliken charges:
elementType: N N C C C C C C C C C C C C H H H H H H H H H H H H
charge: -0.004857 -0.004797 -0.573278 -0.573350 0.523651 0.523696 -0.347549 -0.347560 -0.347634 -0.347623 -0.329209 -0.329214 -0.329184 -0.329195 0.230963 0.230964 0.230985 0.230987 0.233739 0.233700 0.233747 0.233706 0.239326 0.239326 0.239329 0.239330
chargesum: 0.00000
title: Mulliken charges with hydrogens summed into heavy atoms:
elementType: N N C C C C C C C C C C C C
charge: -0.004857 -0.004797 -0.111352 -0.111378 0.523651 0.523696 -0.113809 -0.113860 -0.113887 -0.113917 -0.089883 -0.089888 -0.089854 -0.089865
polarizability: 1.90906680e+02 -1.72534286e-04 1.43102152e+02 -1.45769484e+01 2.80718140e-04 6.99868017e+01
1716.lowfreq: -3.0623 -0.0007 -0.0004 -0.0002 7.9443 23.0662 27.3509 37.3439 51.6840
frequency: 27.3509 37.3439 51.6782 59.4186 114.5300 229.2738 285.7152 309.3193 361.7653 368.9437 370.6942 485.0829 510.9744 550.5892 611.6935 662.6779 663.7705 746.3732 753.3911 788.9645 795.5405 796.7939 828.5752 871.9234 887.0495 887.3727 960.8574 960.9571 961.9867 965.9053 976.1980 976.2542 985.8928 1005.0521 1061.8247 1062.2329 1071.1345 1092.6236 1143.1405 1217.9650 1218.0703 1228.0313 1229.7430 1266.8326 1277.3401 1310.9550 1311.6579 1330.1964 1336.0302 1338.9492 1403.8820 1404.3706 1465.4423 1466.2323 1475.5632 1488.9022 1557.4754 1558.1587 1587.0367 1589.1022 2991.7604 3000.4941 3042.0919 3068.0336 3122.1111 3122.3351 3122.5522 3122.7920 3142.8566 3143.1544 3149.8535 3150.0881
redmass: 3.7356 4.3154 2.8693 5.9347 6.6488 6.6132 4.8971 2.1215 2.6177 2.4781 2.5267 4.0933 6.6142 3.0561 4.6693 6.8945 6.9357 3.9045 3.3230 1.1911 4.9694 1.5550 1.4145 2.8867 1.2473 1.2485 5.4927 3.0952 2.0471 1.3981 1.4934 1.4983 1.7193 4.0787 2.2077 2.1989 1.6406 1.4658 1.1210 1.3532 1.3683 2.2618 2.2663 1.4029 1.4340 7.1965 4.4558 1.3892 1.2937 1.2388 2.0144 2.0213 1.9901 2.0174 1.1077 1.1025 6.7845 6.7014 5.7629 5.6938 1.0594 1.0596 1.1018 1.1050 1.0863 1.0863 1.0887 1.0887 1.0960 1.0960 1.0995 1.0996
irintensity: 0.4468 2.3168 0.0000 3.0929 0.0000 0.0000 1.2319 0.0000 0.0692 0.0000 0.0323 0.0000 9.5988 59.5893 0.0000 0.0000 1.0969 0.0000 2.8727 0.8224 11.9184 0.0007 98.6465 0.0000 0.0076 0.0000 3.8646 0.4969 0.0014 0.7443 0.0038 0.0000 0.0000 0.0000 7.6286 0.0098 0.7654 0.0000 2.5884 3.3632 0.9697 0.0098 4.1616 0.0000 11.9796 2.0545 0.0133 0.0000 1.7131 0.0000 33.9953 0.1058 0.0172 16.1167 0.0000 14.2155 26.7169 0.3550 142.5585 0.0504 0.0039 48.9916 0.0003 24.1352 0.1329 2.9899 27.9655 1.4667 2.5595 112.6226 1.2192 0.0313
temp: 298.150 k
press: 1.00000 atm
elementType: 7 7 6 6 6 6 6 6 6 6 6 6 6 6 1 1 1 1 1 1 1 1 1 1 1 1
symmnumber: 1
zpe: 553398.0 jmol-1
zpe.correction: 0.210778 hartree
zpe.thermalcorrener: 0.222471 hartree
zpe.thermalcorrenthalpy: 0.223415 hartree
zpe.thermalcorrgfe: 0.170303 hartree
zpe.sumelectzpe: -572.975898 hartree
zpe.sumelectthermal: -572.964205 hartree
zpe.sumelectthermalent: -572.963261 hartree
zpe.sumelectthermalfe: -573.016374 hartree
dipole: -0.0004 -0.0011 0.0002
dipole: 0.0012
quadrupole: -121.1678 -68.1900 -86.5687
quadrupole: -0.0005 2.9566 0.0003
quadrupole: -29.1923 23.7855 5.4068 -0.0005 2.9566 0.0003
hfenergy: -573.1866763 hartree
pointgroup: C01 [X(C12H12N2)]
dipole: -0.0001756 -0.0004181 0.0000703 debye
dipolederiv: -0.4195018 0.0000047 0.0143436 -0.0000079 -0.3779626 0.0000623 0.0309353 0.0000495 -0.2546287 -0.4196601 -0.000009 0.0143834 -0.0000049 -0.3780124 -0.0000939 0.0309766 -0.0000795 -0.2546391 -0.157266 0.0000135 -0.0139469 0.0000813 0.1399523 -0.0000168 -0.0328882 0.0000432 0.0925445 -0.1574046 -0.0000014 -0.0139589 -0.0000445 0.1398961 0.0000318 -0.0330731 -0.000025 0.0924708 0.5564536 -0.0000536 -0.0489811 -0.0001122 0.1133239 -0.0000355 -0.165989 -0.0000472 -0.0452535 0.5566214 0.000059 -0.049 0.000159 0.1132551 0.0000797 -0.1660489 0.0000904 -0.0452285 -0.3725593 -0.1677796 0.0124059 -0.1254289 -0.0343036 0.0220042 0.0515758 0.0360233 -0.1123005 -0.3725286 0.1677891 0.0124359 0.125466 -0.0341687 -0.0220047 0.0516243 -0.0360023 -0.1123111 -0.3725497 0.1678276 0.0122498 0.1254812 -0.034394 -0.022078 0.0515229 -0.0360548 -0.112259 -0.3724951 -0.1678444 0.0121992 -0.1255679 -0.0342998 0.0221159 0.0515004 0.0360708 -0.1122415 0.271357 0.1824784 -0.0606538 0.0389277 0.280986 -0.0022359 -0.0660047 -0.0405097 -0.0573493 0.271404 -0.1824595 -0.060693 -0.0389429 0.2810102 0.0023036 -0.0660099 0.0405688 -0.0573387 0.271358 -0.1825469 -0.0605178 -0.0389544 0.2810637 0.0019542 -0.0659634 0.0402104 -0.0573611 0.2713911 0.182552 -0.0604672 0.0390073 0.2811124 -0.0018543 -0.0659446 -0.0401 -0.057377 0.0267307 0.0266843 0.024444 0.0496772 -0.0520665 -0.1161809 0.0464339 -0.0521205 0.0087532 0.0268041 -0.0266486 0.0244046 -0.0497272 -0.0521076 0.1161741 0.0464237 0.0521141 0.0087672 0.0267403 -0.0266977 0.0244467 -0.0497019 -0.0521054 0.1161559 0.0464589 0.0521051 0.0088323 0.0268115 0.0266454 0.0244306 0.0497003 -0.0520257 -0.1161895 0.0464807 -0.05214 0.0087305 0.0535324 0.1128805 0.0302867 0.0887548 -0.0491796 -0.0167344 0.0282472 -0.0230247 0.134925 0.0535007 -0.1129081 0.0302608 -0.0887833 -0.0492938 0.0167014 0.0282314 0.0229919 0.1349163 0.0535025 -0.1128692 0.0303843 -0.088721 -0.0491185 0.0168884 0.0283153 0.0231445 0.1349033 0.0534629 0.112887 0.0304135 0.088747 -0.0492072 -0.0169434 0.0283459 -0.0232006 0.1348712 0.0310548 -0.0890699 0.0178251 -0.0824847 -0.0830625 0.01417 0.0237697 0.019834 0.1296269 0.0310708 0.0890576 0.0178406 0.0824754 -0.0830627 -0.0142126 0.0237655 -0.0198687 0.1296198 0.0310728 0.0890732 0.0177465 0.0824895 -0.0831056 -0.013987 0.0236806 -0.0196403 0.1296575 0.0310967 -0.0890645 0.0177175 -0.0824848 -0.0831234 0.0139255 0.0236337 0.0195674 0.1296693 unknown
polarizability: 190.7563602|0.0012591|143.1021515|-15.1868853|0.008415|70.1371225 unknown
InChI: InChI=1S/C12H12N2/c1(11-3-7-13-8-4-11)2-12-5-9-14-10-6-12/h3-10H,1-2H2
charge 0 multiplicity 1
26 atoms
N  -4.715615 -0.001964 0.273032
N  4.716107 -0.001903 -0.269001
C  -0.424166 -0.002627 -0.654906
C  0.424713 -0.002867 0.658996
C  -1.914296 -0.00241 -0.362467
C  1.914647 -0.002559 0.366449
C  -2.637308 -1.211456 -0.19799
C  2.637918 -1.211501 0.201659
C  -2.637202 1.20687 -0.199118
C  2.637762 1.206724 0.203358
C  -4.01482 -1.164898 0.113587
C  4.015411 -1.164871 -0.109888
C  -4.014713 1.160754 0.112584
C  4.015254 1.160748 -0.108332
H  -0.149995 -0.892358 -1.252439
H  -0.149772 0.887146 -1.252254
H  0.150472 -0.89277 1.256213
H  0.150276 0.886656 1.256661
H  -2.138309 -2.180265 -0.319023
H  2.138956 -2.18038 0.322473
H  -2.138075 2.175513 -0.320921
H  2.13863 2.175356 0.325416
H  -4.591676 -2.088317 0.240435
H  4.592229 -2.08829 -0.236888
H  -4.591468 2.084348 0.238634
H  4.591942 2.084422 -0.234072
