program: Gaussian 09
title: 000081581
version: EM64L-G09RevD.01
frameworkgroup: C1[X(C21H26N2O)]
method: RPBEPBE
basis: SDD
operation: Freq
keyword: #p
keyword: freq=noraman
keyword: PBEPBE/SDD
title: #p freq=noraman PBEPBE/SDD
converged: NO YES NO NO
title: Mulliken charges:
elementType: O N N C C C C C C C C C C C C C C C C C C C C C H H H H H H H H H H H H H H H H H H H H H H H H H H
charge: -0.279979 -0.079912 -0.370098 0.256414 -0.486987 -0.517187 -0.387266 -0.392507 -0.445337 0.472580 -0.479586 -0.369958 -0.421515 0.449264 -0.262824 -0.260285 0.275784 -0.246196 -0.448131 -0.380510 -0.776571 -0.221723 -0.229388 -0.246292 0.207827 0.202011 0.181870 0.216503 0.207320 0.228083 0.206987 0.200566 0.250356 0.221780 0.194610 0.218942 0.292726 0.225046 0.233019 0.226374 0.222194 0.227985 0.231887 0.263334 0.252009 0.255950 0.206340 0.224074 0.223680 0.226734
chargesum: 0.00000
title: Mulliken charges with hydrogens summed into heavy atoms:
elementType: O N N C C C C C C C C C C C C C C C C C C C C C
charge: -0.279979 -0.079912 -0.077371 0.256414 -0.077149 -0.118814 0.048137 0.015047 0.026799 0.472580 -0.066033 -0.144912 -0.188496 0.449264 -0.036450 -0.038091 0.275784 -0.018211 -0.216244 -0.117176 -0.062271 0.002350 -0.005708 -0.019558
polarizability: 2.78969483e+02 1.88179886e+01 2.21547966e+02 1.46949580e+01 6.50344520e+00 1.94870268e+02
1716.lowfreq: -6.5350 -0.0006 -0.0003 0.0005 3.2425 7.5064 18.1103 25.5874 31.2483
frequency: 17.7529 25.4521 31.1672 34.6077 40.5774 52.5092 61.7635 76.1000 88.0740 132.3510 159.0831 181.9896 198.3461 204.1428 239.4309 247.4909 279.5167 305.4970 318.9925 334.1063 351.4794 380.0558 406.0270 407.5652 422.8552 449.2523 465.1745 478.1915 494.4205 508.7728 532.6362 565.4578 591.8385 600.7813 609.8436 616.5462 617.8163 648.8485 691.9123 705.3110 706.5770 737.7258 768.6017 773.4956 807.6213 809.5919 828.1678 849.5161 859.8596 894.4508 910.7928 916.9270 939.8054 964.0855 972.6624 978.2200 982.4782 985.8053 989.8779 991.2896 993.2026 998.3559 1012.6574 1018.4636 1024.5045 1028.1535 1030.5408 1040.6845 1076.1420 1077.9017 1087.4122 1102.6478 1109.0393 1129.7054 1139.9394 1166.9591 1169.4892 1174.4539 1179.9464 1183.6370 1190.8766 1203.8464 1210.9226 1217.4428 1241.0045 1251.9712 1270.1189 1292.7953 1313.1161 1320.7546 1321.3266 1334.2209 1339.6610 1344.0992 1361.4177 1364.7242 1376.8308 1381.4118 1386.2084 1397.1691 1433.5863 1440.2230 1449.8163 1455.1090 1459.6255 1464.7132 1466.8296 1471.3446 1475.3803 1481.5704 1484.2794 1486.6405 1487.6419 1588.7667 1594.1331 1612.5284 1614.4203 1621.3323 2845.1756 2858.7630 2871.4123 2968.7100 2974.3702 2981.8529 2989.1253 2994.0899 3013.2850 3029.8715 3042.1763 3052.0184 3064.9956 3093.5834 3101.8801 3111.5410 3120.8302 3121.7377 3127.7015 3134.9504 3141.9532 3146.1395 3152.8533 3160.7751 3165.0212 3561.9269
redmass: 5.6360 4.6150 4.5382 3.9056 4.1054 3.7631 3.9571 1.6313 1.8915 3.9964 3.1635 4.9525 4.2762 3.8114 3.6850 3.9180 2.8821 2.7597 2.0766 2.9077 2.6155 2.0627 2.8491 2.8008 2.6585 3.1457 2.9131 3.2467 3.1335 2.6606 1.5843 3.0462 2.4312 3.8348 3.5778 6.3065 6.3346 2.6529 5.0044 2.1959 1.5913 1.6385 2.1465 2.6928 2.6748 1.8978 2.5558 1.2550 1.2485 2.8341 1.5155 1.4402 2.1019 2.1438 1.4246 1.6301 1.4004 1.9515 5.8657 2.4557 1.9144 1.4103 1.7034 2.9308 1.9786 2.1693 2.2538 1.6432 1.6943 2.1509 1.7952 2.4420 3.4344 3.0832 3.2435 2.2233 1.0658 1.0813 1.1343 2.1234 1.0813 1.1218 2.2805 1.2322 1.3960 1.7193 1.5168 1.4335 1.4081 1.6730 1.3462 1.3658 1.3625 1.3984 1.3709 1.4312 5.6270 3.3819 1.2352 1.7635 2.2142 2.0952 1.0512 1.0974 1.1174 1.1130 1.1015 1.1004 1.1426 1.7004 1.3454 1.7893 1.8691 5.8216 6.1694 5.9980 6.1359 6.1976 1.0706 1.0710 1.0690 1.0665 1.0604 1.0862 1.0618 1.0362 1.0878 1.1010 1.0887 1.0990 1.0948 1.0996 1.0987 1.0869 1.0844 1.0861 1.0872 1.0915 1.0925 1.0954 1.0943 1.1014 1.1005 1.0773
irintensity: 3.8143 3.1072 1.0385 0.7992 3.6520 0.3181 5.2168 3.6618 0.2617 0.6507 1.0341 1.6130 4.3613 5.9600 0.8563 0.7730 0.4934 1.6670 3.1065 2.9377 0.2144 3.2362 0.2878 0.0219 2.4081 7.8519 20.7088 6.9658 7.0369 6.0867 72.5175 21.5584 21.2318 4.6319 4.9183 0.2099 0.0672 15.2461 0.6919 33.7488 61.6001 54.7574 31.3965 14.4410 2.5460 2.3299 6.2401 0.1875 0.3676 4.1546 3.3810 5.9358 7.6826 36.9571 0.4586 6.9935 0.0930 1.8898 0.0821 1.1497 0.1296 1.7179 8.2176 14.6066 3.0212 13.9060 2.9460 12.6641 15.6172 11.1365 8.7962 13.9606 2.1012 24.3583 8.2231 5.3521 0.2056 0.6407 0.8920 13.9000 5.3036 0.1663 1.5521 18.0791 5.6378 107.0746 13.7332 17.2559 15.9273 8.8563 2.0822 0.3700 13.3962 12.2577 4.4081 6.3627 0.9103 10.9411 57.2100 3.7446 7.3805 11.3610 21.1690 9.0604 7.7044 41.8096 39.1442 4.2478 56.4645 17.9330 0.7267 152.1849 35.7359 1.4277 1.1202 6.1962 7.8200 157.3322 44.8815 33.6805 140.9959 47.5570 37.1494 19.1534 35.4231 12.8094 61.2107 49.6997 34.1382 33.7544 11.2130 18.2507 11.9530 8.7646 3.7481 0.1645 1.7744 19.3655 30.7341 32.9633 40.9074 29.6262 11.9279 10.9605
temp: 298.150 k
press: 1.00000 atm
elementType: 8 7 7 6 6 6 6 6 6 6 6 6 6 6 6 6 6 6 6 6 6 6 6 6 1 1 1 1 1 1 1 1 1 1 1 1 1 1 1 1 1 1 1 1 1 1 1 1 1 1
symmnumber: 1
zpe: 1112645.0 jmol-1
zpe.correction: 0.423784 hartree
zpe.thermalcorrener: 0.446201 hartree
zpe.thermalcorrenthalpy: 0.447145 hartree
zpe.thermalcorrgfe: 0.369155 hartree
zpe.sumelectzpe: -998.794137 hartree
zpe.sumelectthermal: -998.771720 hartree
zpe.sumelectthermalent: -998.770776 hartree
zpe.sumelectthermalfe: -998.848766 hartree
dipole: -1.0641 0.5106 3.5213
dipole: 3.7138
quadrupole: -151.2781 -136.8285 -140.7684
quadrupole: 2.7761 19.2737 -4.2773
quadrupole: -8.3197 6.1298 2.1899 2.7761 19.2737 -4.2773
hfenergy: -999.2179212 hartree
pointgroup: C01 [X(C21H26N2O1)]
dipole: -0.4137245 0.1529544 -1.3929627 debye
polarizability: 279.7309168|-13.2514021|216.0257673|-18.8068046|11.8098116|199.6310339 unknown
InChI: InChI=1S/C21H26N2O/c1-18(24)22-17-21(20-10-6-3-7-11-20)12-14-23(15-13-21)16-19-8-4-2-5-9-19/h2-11,22H,12-17H2,1H3
charge 0 multiplicity 1
50 atoms
O  4.748958 1.27224 1.852351
N  -1.708265 0.379827 -0.769061
N  3.35153 1.930508 0.107736
C  1.147178 0.645206 0.138194
C  -0.069306 0.44412 1.099108
C  0.580059 1.281524 -1.167513
C  -1.227007 -0.328279 0.445131
C  -0.62089 0.517777 -1.767663
C  2.105894 1.67182 0.837281
C  1.915876 -0.679127 -0.090812
C  -2.919209 -0.24857 -1.347314
C  2.362242 -1.432137 1.029537
C  2.261558 -1.161835 -1.379862
C  -4.162769 -0.072367 -0.479772
C  3.104097 -2.620992 0.87176
C  3.006211 -2.352561 -1.546304
C  4.601717 1.685946 0.662077
C  3.4284 -3.092952 -0.421094
C  -5.131011 -1.1025 -0.392021
C  -4.394078 1.144583 0.210353
C  5.790513 1.947836 -0.25943
C  -6.314353 -0.920044 0.360677
C  -5.572114 1.32835 0.967061
C  -6.539358 0.297684 1.042736
H  -0.446299 1.440759 1.403734
H  0.245563 -0.081941 2.018728
H  1.364745 1.386498 -1.943027
H  0.230688 2.302871 -0.917387
H  -0.897915 -1.370409 0.199637
H  -2.068591 -0.407012 1.156203
H  -1.014088 1.083535 -2.634196
H  -0.291965 -0.482202 -2.146431
H  2.412047 1.300176 1.830941
H  1.548323 2.619538 0.986253
H  -2.767217 -1.33944 -1.553894
H  -3.09668 0.233644 -2.330733
H  3.297204 2.259252 -0.856607
H  2.151721 -1.079324 2.045508
H  1.95588 -0.612835 -2.275876
H  3.439988 -3.171049 1.757897
H  3.255174 -2.699101 -2.556175
H  4.005767 -4.015674 -0.546895
H  -4.957626 -2.053159 -0.912628
H  -3.631069 1.928836 0.150848
H  6.496793 2.627021 0.247275
H  6.320188 0.995585 -0.436889
H  5.508543 2.38376 -1.234072
H  -7.053864 -1.726909 0.419699
H  -5.738149 2.273371 1.497415
H  -7.453735 0.44035 1.629818
