program: Gaussian 09
title: 000078632
version: EM64L-G09RevD.01
frameworkgroup: C1[X(C8H7NO5)]
method: RPBEPBE
basis: SDD
operation: Freq
keyword: #pfreq=noraman
keyword: PBEPBE/SDD
title: #p freq=noraman PBEPBE/SDD
converged: YES YES NO NO
title: Mulliken charges:
elementType: O O O O O N C C C C C C C C H H H H H H H
charge: -0.290773 -0.422957 -0.235012 -0.163630 -0.179446 0.041344 0.165394 0.184014 0.273802 -0.367379 -0.333197 -0.193055 0.135263 -0.516405 0.282922 0.261436 0.244812 0.215125 0.255755 0.244650 0.397337
chargesum: 0.00000
title: Mulliken charges with hydrogens summed into heavy atoms:
elementType: O O O O O N C C C C C C C C
charge: -0.290773 -0.025620 -0.235012 -0.163630 -0.179446 0.041344 0.165394 0.184014 0.273802 -0.084457 -0.071761 0.051757 0.135263 0.199124
polarizability: 1.42822092e+02 -6.30262319e-01 1.29463060e+02 -4.10912384e+00 1.43372244e+00 6.39655098e+01
1716.lowfreq: -8.2424 -3.7040 -0.0012 -0.0010 -0.0007 5.7387 33.8447 55.9768 83.2373
frequency: 33.8394 55.9297 83.2156 103.2747 154.1797 159.2281 161.2670 167.9410 206.0082 280.0827 305.6660 348.5847 370.9727 422.7691 488.7327 503.1260 552.7326 576.0529 609.4190 619.0512 670.7765 701.6523 723.2699 757.3404 792.3134 822.4983 858.3285 932.1165 980.4370 995.3352 1041.1490 1052.0178 1108.5655 1115.3458 1150.8212 1169.9093 1208.1995 1229.3944 1249.6880 1324.1188 1372.7848 1397.3655 1414.7976 1437.0282 1456.4129 1459.5793 1474.6004 1578.8514 1595.6457 1641.5209 2974.4589 3077.4947 3136.4570 3149.5607 3164.7487 3178.9777 3540.0462
redmass: 12.6810 4.2780 4.2810 8.2483 4.3567 3.3804 1.3016 9.9861 4.9208 5.8391 6.5650 9.2280 5.1143 8.2177 4.6989 5.5482 2.6660 3.8512 1.7240 5.2432 6.9027 8.0239 6.9177 2.5148 8.4987 2.0053 6.7483 1.4067 8.0857 1.3774 2.7978 4.2721 1.2819 1.9118 1.3378 1.2703 1.8051 2.6316 8.0898 2.8988 8.6904 6.7540 2.6943 1.5201 1.1941 1.9383 1.0547 6.4766 7.4631 9.5222 1.0319 1.1034 1.1024 1.0873 1.0927 1.0994 1.0645
irintensity: 2.2422 3.2099 4.0116 3.0567 3.5270 1.2711 0.0523 3.7668 1.6806 2.1572 1.6549 0.5023 5.8753 21.5609 1.2399 3.2928 44.3708 10.9238 111.3233 19.6403 0.2885 20.6468 28.6152 31.7729 10.2221 30.4942 16.5303 1.9272 82.8246 6.5900 217.4661 4.8458 4.1453 10.2912 3.2982 25.2889 44.1416 44.4530 120.6879 124.5469 11.1260 156.6591 44.2660 8.2471 15.9534 32.0543 15.1066 72.8439 5.8274 252.4629 53.7305 23.8347 19.0578 4.3228 1.2440 7.4647 60.0668
temp: 298.150 k
press: 1.00000 atm
elementType: 8 8 8 8 8 7 6 6 6 6 6 6 6 6 1 1 1 1 1 1 1
symmnumber: 1
zpe: 377635.2 jmol-1
zpe.correction: 0.143834 hartree
zpe.thermalcorrener: 0.156906 hartree
zpe.thermalcorrenthalpy: 0.157851 hartree
zpe.thermalcorrgfe: 0.103294 hartree
zpe.sumelectzpe: -738.793467 hartree
zpe.sumelectthermal: -738.780394 hartree
zpe.sumelectthermalent: -738.779450 hartree
zpe.sumelectthermalfe: -738.834007 hartree
dipole: 1.9382 3.5284 -2.2892
dipole: 4.6311
quadrupole: -72.5091 -76.2680 -83.9971
quadrupole: 9.4223 -1.0646 1.7428
quadrupole: 5.0823 1.3234 -6.4057 9.4223 -1.0646 1.7428
hfenergy: -738.9373003 hartree
pointgroup: C01 [X(C8H7N1O5)]
dipole: 0.9090752 1.3812342 -0.7651649 debye
dipolederiv: -1.2429079 0.3759879 0.1999198 0.4525104 -0.5549612 -0.1215752 0.1156383 -0.03114 -0.3940548 -0.3816843 -0.1454893 -0.086509 -0.236385 -1.0057606 -0.3142497 -0.1749786 -0.3102737 -0.5083502 -1.0789961 0.2275961 0.0862128 0.0790823 -0.5849512 -0.1369755 -0.0222208 -0.1112439 -0.3757198 -0.2926877 -0.0723188 0.2011986 -0.1225476 -0.5712333 0.182087 0.2084391 0.0465108 -0.5887976 -0.3065593 0.0342421 0.2079482 0.0886643 -0.5888186 -0.1886582 0.1944924 -0.0072555 -0.6096621 0.3756561 0.0480375 -0.4394127 0.0582289 1.0974957 0.0036817 -0.388858 -0.0351127 1.0726654 0.1030467 0.2165697 0.0931384 -0.121303 0.0089992 -0.0414914 0.0146841 -0.0146144 -0.0461244 -0.5270326 -0.2446271 -0.0628766 -0.1812545 -0.0352454 -0.0568148 -0.0284121 0.0299156 0.0268895 0.8613158 -0.4037253 -0.0307371 -0.6543059 0.2941517 0.0619672 0.1003441 -0.1319679 -0.0058807 -0.0290035 -0.1112542 0.0071098 0.0634464 -0.1050545 0.0074098 0.0448586 0.0183071 -0.1105501 -0.0247042 -0.0175247 0.0424042 0.2841259 -0.0634967 0.002533 0.0194308 0.0153651 -0.1153787 -0.0332083 0.1342026 0.0138713 0.0111806 0.1591104 0.0209307 0.0109606 0.0267672 -0.1228147 1.7137048 0.0283341 0.0342101 0.28896 1.2418445 0.5148488 0.1685356 0.4270591 0.4509432 0.6236553 -0.1223803 -0.1957259 -0.046752 0.2958475 0.0571267 -0.3721609 0.1399399 0.4198365 0.0551052 0.0691979 -0.0090406 0.0379909 0.0769909 0.0014812 -0.0224034 -0.0123818 0.1583202 -0.0301323 -0.0508423 -0.0256764 -0.0371914 0.0837765 -0.002247 -0.0286863 0.0013963 0.152871 0.0799996 -0.016604 -0.0080574 -0.0211753 -0.0826214 -0.0206115 -0.0061765 -0.0164685 0.1568867 0.0224899 -0.0266144 0.0681147 -0.1189799 -0.1097088 0.0895484 0.0971685 0.0045922 0.019097 0.0308002 -0.0522638 -0.0931155 -0.0193213 0.0550004 -0.0743683 0.033984 -0.0878301 -0.0360981 -0.0576055 0.1037246 -0.0084875 0.1278231 0.0409336 0.0259268 -0.0326173 0.0407242 0.0663452 0.138748 0.0257516 0.0055105 0.0672029 0.347701 -0.0105498 0.0679776 0.0077111 0.3895764 unknown
polarizability: 142.5478808|-1.6602697|128.7303363|-3.9651159|8.3463209|64.9724454 unknown
InChI: InChI=1S/C8H7NO5/c1-14-6-4-2-3-5(8(10)11)7(6)9(12)13/h2-4,10H,1H3
charge 0 multiplicity 1
21 atoms
O  2.508404 -0.451897 0.333778
O  -2.482851 -1.055212 -0.820251
O  -3.455194 0.899955 -0.028746
O  -0.501805 -2.203255 0.985797
O  0.529724 -2.218743 -1.050688
N  0.029583 -1.62279 -0.026145
C  0.117922 -0.135945 -0.001146
C  -1.026968 0.699398 -0.065111
C  1.416877 0.409808 0.151574
C  -0.845055 2.101832 0.034934
C  1.573982 1.811873 0.239661
C  0.443412 2.653912 0.184314
C  -2.429925 0.222583 -0.270213
C  3.374857 -0.651919 -0.854162
H  -1.734949 2.736764 -0.008647
H  2.57958 2.218546 0.387631
H  0.565835 3.738307 0.265526
H  3.774349 0.314367 -1.217253
H  2.802952 -1.160098 -1.650512
H  4.196858 -1.292895 -0.504742
H  -3.427588 -1.348791 -0.918199
