program: Gaussian 09
title: 000081709
version: EM64L-G09RevD.01
frameworkgroup: C1[X(C22H24Cl2N2O2)]
method: RPBEPBE
basis: SDD
operation: Freq
keyword: #p
keyword: freq=noraman
keyword: PBEPBE/SDD
title: #p freq=noraman PBEPBE/SDD
converged: YES YES NO NO
title: Mulliken charges:
elementType: Cl Cl O O N N C C C C C C C C C C C C C C C C C C C C C C H H H H H H H H H H H H H H H H H H H H H H H H
charge: -0.012234 -0.032703 -0.280117 -0.265212 -0.366800 -0.374332 -0.182761 -0.168898 -0.458615 -0.435701 -0.440913 -0.450780 0.216221 0.236306 -0.479191 -0.485418 0.553313 0.564107 -0.340737 -0.330398 -0.403309 -0.400917 -0.216192 -0.219987 -0.232930 -0.231458 -0.228215 -0.228330 0.231456 0.182985 0.178992 0.206110 0.188022 0.248193 0.199807 0.256647 0.255921 0.207396 0.307130 0.298569 0.224767 0.276150 0.225571 0.274528 0.237912 0.238628 0.260049 0.257805 0.232597 0.233752 0.236090 0.237129
chargesum: 0.00000
title: Mulliken charges with hydrogens summed into heavy atoms:
elementType: Cl Cl O O N N C C C C C C C C C C C C C C C C C C C C C C
charge: -0.012234 -0.032703 -0.280117 -0.265212 -0.059670 -0.075763 0.048694 0.014087 -0.073514 0.000513 0.015541 0.012537 0.216221 0.236306 0.021726 0.014681 0.553313 0.564107 -0.340737 -0.330398 -0.165397 -0.162290 0.043857 0.037818 -0.000333 0.002294 0.007874 0.008800
polarizability: 3.75147680e+02 -1.70414938e+01 2.30838277e+02 -1.04430566e+01 2.50321486e+01 2.10021427e+02
1716.lowfreq: 0.0015 0.0019 0.0024 2.4507 7.6821 9.3382 12.8066 18.9693 22.5239
frequency: 10.9216 15.1795 21.6328 30.9001 34.0267 42.2692 44.9205 54.0537 63.2365 110.1377 129.3190 134.8655 150.3627 169.5875 182.7990 192.0931 214.3009 228.7808 238.2546 248.0756 254.5869 265.5719 292.5932 336.5827 349.3688 358.1923 370.7004 378.5293 409.5672 424.2692 426.6732 448.9934 452.5611 486.2665 490.5181 528.5652 537.4702 542.4486 550.7438 555.8340 576.5420 589.8400 594.6765 661.4432 663.1180 696.9630 718.8389 728.9935 730.0134 752.8601 760.9160 761.5080 790.9001 800.1451 822.3653 831.2174 858.5892 871.6990 873.4362 906.4995 914.5216 920.0285 938.4975 946.9064 948.4390 972.9616 982.3200 987.2225 987.6586 1015.2587 1024.3980 1026.6934 1037.2161 1038.0870 1049.1617 1051.6186 1063.8573 1068.3465 1098.5460 1107.6983 1128.0980 1128.2841 1152.0139 1172.4126 1172.6670 1175.4486 1183.3204 1209.9146 1211.5666 1213.1942 1217.6954 1219.1164 1231.9103 1267.9822 1274.1487 1274.8596 1282.9236 1290.4133 1300.3379 1316.2910 1331.6260 1339.8196 1345.7214 1350.3710 1356.4318 1367.1541 1378.0743 1378.1377 1427.0911 1427.2373 1452.2298 1461.6225 1462.2354 1464.0043 1464.5153 1468.1018 1477.2458 1485.2694 1486.5036 1496.3093 1576.9069 1577.3858 1593.4026 1604.1651 1604.6215 1613.6559 2937.8476 2952.4920 2966.3263 2977.8655 2979.6779 2982.5688 2992.0591 2994.4445 3005.9818 3045.3454 3046.3627 3053.4642 3059.5233 3069.7483 3124.2196 3124.7164 3141.8653 3142.1751 3159.7585 3159.8231 3174.8303 3175.0384 3549.4833 3561.5078
redmass: 6.6914 7.5956 8.1729 8.4540 6.3290 8.6340 6.9729 7.2212 5.2956 4.8273 4.2546 4.1142 3.8871 4.7009 5.9826 6.5748 4.4649 4.9551 3.3256 4.2216 4.6739 3.2785 5.2740 3.3048 3.9692 3.2866 4.2284 2.6901 2.9449 3.9925 3.6881 3.1498 3.4353 3.2511 3.3401 2.8479 3.4757 2.5708 3.2633 1.1985 1.8332 3.8573 4.2362 6.4202 6.3222 5.4289 5.2048 4.1886 4.4619 3.9846 1.2384 1.2507 1.4996 3.5716 3.0766 3.6615 2.3571 1.4421 1.5983 2.5288 2.3554 2.3396 1.4637 1.4042 1.3950 2.1668 2.0229 1.3405 1.3969 3.6999 6.8939 4.5446 2.4603 2.2614 2.0679 2.6518 2.8069 1.9568 1.1976 2.0245 1.5969 1.5980 2.2828 1.0666 1.0715 1.5309 1.5312 1.4942 1.4952 1.7695 1.7257 1.6199 1.4278 1.3290 1.3516 1.3381 1.3887 1.5481 1.4463 1.4645 1.3933 1.3931 1.5084 1.5201 1.4428 1.6598 5.6571 5.9114 2.1624 2.1597 1.0988 2.0102 2.1053 1.7790 2.0192 1.2076 1.0895 1.1358 1.1377 1.1579 6.1050 6.1576 7.3513 7.1906 7.0764 6.4575 1.0826 1.0719 1.0678 1.0647 1.0635 1.0700 1.0645 1.0634 1.0944 1.0976 1.0964 1.1017 1.1010 1.0971 1.0880 1.0880 1.0890 1.0890 1.0946 1.0948 1.0997 1.0996 1.0778 1.0775
irintensity: 1.3270 0.7213 0.6373 0.5213 0.5353 4.3523 0.2702 5.3177 2.3423 1.4508 1.5121 3.4444 1.2370 1.7041 0.5545 4.0006 8.1786 2.2404 1.0252 8.4992 7.1532 3.3795 5.7031 12.6178 3.6332 9.8798 5.7571 2.9199 1.3595 4.9732 4.6235 1.5286 9.9581 6.1312 4.0452 37.9431 3.3986 21.9216 6.2617 78.9724 28.1552 25.3123 12.9049 19.1436 15.7674 1.1653 5.8842 0.9402 6.7191 6.0880 45.9170 118.9249 0.7182 6.9162 7.6429 2.0039 1.8609 0.5114 1.9886 3.6185 9.2533 5.0622 4.3750 3.0127 2.7311 25.5480 4.0160 0.1428 0.7372 27.8388 31.3842 50.9446 1.4916 9.3884 5.1232 1.2329 2.6421 2.8994 1.5392 2.6372 1.1328 0.1560 4.8414 6.6031 5.6820 29.7994 57.6184 3.4110 34.6201 36.0673 19.3553 14.5506 38.0206 3.0959 4.5870 20.1535 13.3646 15.7244 2.2051 3.2180 1.5577 0.9931 12.9229 4.4492 1.8455 6.2374 2.7796 1.7906 42.9124 18.2530 6.9645 385.4623 35.0420 25.5230 170.8280 26.0527 16.4337 31.8891 26.1831 48.9745 7.4390 11.6922 151.9931 4.8888 7.4198 163.8628 35.4600 13.5893 59.1835 55.8639 49.2384 59.4631 37.9876 15.8450 64.3428 12.8302 11.4091 25.9580 36.0184 15.6453 6.0197 5.8999 8.9785 8.1904 18.9827 16.1650 15.5374 13.0330 13.8790 12.2067
temp: 298.150 k
press: 1.00000 atm
elementType: 17 17 8 8 7 7 6 6 6 6 6 6 6 6 6 6 6 6 6 6 6 6 6 6 6 6 6 6 1 1 1 1 1 1 1 1 1 1 1 1 1 1 1 1 1 1 1 1 1 1 1 1
symmnumber: 1
zpe: 1092999.9 jmol-1
zpe.correction: 0.416302 hartree
zpe.thermalcorrener: 0.442627 hartree
zpe.thermalcorrenthalpy: 0.443571 hartree
zpe.thermalcorrgfe: 0.355035 hartree
zpe.sumelectzpe: -2030.803147 hartree
zpe.sumelectthermal: -2030.776822 hartree
zpe.sumelectthermalent: -2030.775878 hartree
zpe.sumelectthermalfe: -2030.864413 hartree
dipole: -1.3132 1.0469 -5.7591
dipole: 5.9990
quadrupole: -120.1253 -177.0863 -178.8911
quadrupole: -7.2079 -4.5308 -5.1670
quadrupole: 38.5756 -18.3854 -20.1902 -7.2079 -4.5308 -5.1670
hfenergy: -2031.2194484 hartree
pointgroup: C01 [X(C22H24Cl2N2O2)]
dipole: -0.5355444 -0.3473738 2.2722172 debye
polarizability: 375.4217372|15.3446668|231.6907385|11.3727244|24.4386113|208.8949088 unknown
InChI: InChI=1S/C22H24Cl2N2O2/c23-19-7-3-1-5-17(19)13-25-21(27)15-9-11-16(12-10-15)22(28)26-14-18-6-2-4-8-20(18)24/h1-8,15-16,25-26H,9-14H2
charge 0 multiplicity 1
52 atoms
Cl 2.567507 1.398742 -1.179979
Cl -3.728685 0.37874 -2.0386
O  2.344356 -2.582436 -1.746416
O  -0.906159 1.328808 0.44597
N  3.550696 -1.621154 -0.022022
N  -2.842268 0.292336 1.207235
C  1.504655 -2.951313 0.543588
C  -0.767688 -1.042767 1.109532
C  1.380185 -2.177404 1.885106
C  0.101025 -3.132871 -0.093727
C  0.633636 -0.830822 1.736238
C  -0.638834 -1.786058 -0.253971
C  2.479723 -2.354942 -0.503393
C  -1.486627 0.295971 0.900102
C  4.564813 -1.051424 -0.931392
C  -3.708321 1.455754 0.943273
C  5.060073 0.307795 -0.467784
C  -5.049203 1.050844 0.352014
C  4.266757 1.481301 -0.524577
C  -5.194918 0.539789 -0.961793
C  6.37902 0.447647 0.039644
C  -6.233872 1.175583 1.125239
C  4.740138 2.736065 -0.093834
C  -6.441294 0.159129 -1.494926
C  6.879547 1.69435 0.47469
C  -7.497251 0.803294 0.61563
C  6.056701 2.841456 0.409617
C  -7.601036 0.290836 -0.697078
H  1.91185 -3.961934 0.76376
H  -1.371523 -1.680475 1.793235
H  2.366944 -2.019821 2.367167
H  0.817261 -2.826072 2.58772
H  -0.493645 -3.814744 0.548165
H  0.216383 -3.610137 -1.082086
H  0.536255 -0.345513 2.726595
H  1.195914 -0.131244 1.090337
H  -0.084869 -1.13997 -0.960827
H  -1.641263 -1.955466 -0.691117
H  3.633014 -1.430072 0.976827
H  -3.268729 -0.55769 1.579838
H  5.428047 -1.740777 -1.018453
H  4.085487 -1.001247 -1.926343
H  -3.882695 2.026634 1.876676
H  -3.131471 2.107163 0.260557
H  7.017228 -0.443311 0.085603
H  -6.1519 1.575864 2.143189
H  4.090425 3.613818 -0.157524
H  -6.503875 -0.22579 -2.517012
H  7.902289 1.770446 0.858379
H  -8.392397 0.913644 1.236495
H  6.431274 3.815066 0.742933
H  -8.57398 -0.00182 -1.105602
