program: Gaussian 09
title: 000078633
version: EM64L-G09RevD.01
frameworkgroup: C1[X(C8H9NO4)]
method: RPBEPBE
basis: SDD
operation: Freq
keyword: #pfreq=noraman
keyword: PBEPBE/SDD
title: #p freq=noraman PBEPBE/SDD
converged: YES YES NO NO
title: Mulliken charges:
elementType: O O O O N C C C C C C C C H H H H H H H H H
charge: -0.279565 -0.248787 -0.219785 -0.211998 0.022127 0.280506 0.250592 0.365450 -0.461470 -0.341646 -0.345534 -0.514747 -0.535663 0.282670 0.282164 0.254526 0.210816 0.258586 0.239016 0.253989 0.230474 0.228281
chargesum: 0.00000
title: Mulliken charges with hydrogens summed into heavy atoms:
elementType: O O O O N C C C C C C C C
charge: -0.279565 -0.248787 -0.219785 -0.211998 0.022127 0.280506 0.250592 0.365450 -0.178801 -0.059482 -0.091008 0.193671 0.177081
polarizability: 1.78610173e+02 2.38557148e-01 1.23110730e+02 6.39048772e-01 -1.66297306e+00 5.49800121e+01
1716.lowfreq: -12.7194 -8.2948 -0.0006 -0.0003 0.0010 6.6045 27.7025 74.8386 92.7053
frequency: 27.5790 74.8323 92.7011 123.7733 137.0370 173.2871 189.7232 215.0083 238.3197 287.6973 300.9225 330.5207 341.5128 426.6160 473.2958 524.1026 574.0066 593.3143 647.1878 667.1811 698.1127 732.3530 762.3751 816.2389 860.2061 881.0269 959.0366 963.4492 998.3883 1072.1175 1101.5124 1110.7948 1141.2718 1143.7275 1152.1926 1174.9460 1216.8771 1230.4653 1270.5348 1342.8112 1391.8663 1414.2537 1428.0330 1441.4313 1452.4763 1469.4231 1470.1924 1471.1007 1480.2322 1559.5411 1615.4912 2972.7850 2976.7031 3066.8122 3088.3855 3135.7412 3137.3571 3165.8303 3181.2423 3184.5850
redmass: 7.7287 3.9542 3.9265 3.3396 1.0792 4.4773 3.8276 1.1885 5.5103 4.5189 5.4107 5.8543 6.8593 5.1847 3.7695 6.2981 6.5023 5.3494 4.9996 4.3402 6.7755 3.7753 9.8797 1.5430 5.7200 1.6813 2.8419 1.9636 3.2323 4.2613 1.2268 1.2579 1.8034 1.5634 1.4103 1.5789 8.0883 1.9654 2.4515 5.9370 8.8312 2.1587 1.3831 1.4243 1.1168 1.0558 1.1592 2.1752 1.0544 7.0968 6.9940 1.0325 1.0338 1.1046 1.0994 1.1036 1.1004 1.0878 1.0927 1.0963
irintensity: 0.4682 1.0642 9.2638 4.6103 0.2701 3.4119 4.4261 0.5292 0.3933 3.4055 2.1856 2.4202 5.0612 4.1992 6.3111 4.6143 11.6247 19.8251 7.6606 17.9566 2.1548 5.5387 8.9845 40.1570 4.8580 36.6025 10.8481 16.6894 54.8419 93.9647 9.1484 0.1176 112.5406 33.6429 43.6024 17.3554 583.6896 9.3394 28.8887 65.7941 46.3337 43.9396 12.9157 6.9319 16.0128 16.6689 77.8869 43.7548 16.9274 107.5406 291.7391 62.1055 70.3087 38.4559 22.1844 16.5542 17.8723 2.4348 0.5565 4.8403
temp: 298.150 k
press: 1.00000 atm
elementType: 8 8 8 8 7 6 6 6 6 6 6 6 6 1 1 1 1 1 1 1 1 1
symmnumber: 1
zpe: 425694.4 jmol-1
zpe.correction: 0.162138 hartree
zpe.thermalcorrener: 0.174803 hartree
zpe.thermalcorrenthalpy: 0.175747 hartree
zpe.thermalcorrgfe: 0.122301 hartree
zpe.sumelectzpe: -664.804349 hartree
zpe.sumelectthermal: -664.791684 hartree
zpe.sumelectthermalent: -664.790740 hartree
zpe.sumelectthermalfe: -664.844186 hartree
dipole: 6.3246 0.8767 1.9582
dipole: 6.6786
quadrupole: -71.6712 -73.5463 -76.7659
quadrupole: -14.5607 -1.6416 1.4800
quadrupole: 2.3233 0.4482 -2.7715 -14.5607 -1.6416 1.4800
hfenergy: -664.966487 hartree
pointgroup: C01 [X(C8H9N1O4)]
dipole: -2.5120224 -0.235396 0.7338362 debye
dipolederiv: -0.7900789 0.5832661 -0.1267018 0.5118846 -0.9906131 0.156694 -0.0224892 0.0169006 -0.3808641 -1.9714958 0.0098939 0.0060485 -0.2359983 -0.3224359 -0.0010855 -0.0027478 -0.0084676 -0.292517 -0.5936585 -0.1879464 0.0048622 -0.3557181 -0.8899945 0.12584 0.0033963 0.1043116 -0.2642871 -0.9066743 0.1647633 -0.0832795 0.2501289 -0.5129051 0.103224 -0.074901 0.1508493 -0.2474995 1.9185972 0.2877631 0.0926982 0.3131396 1.1822914 -0.2632858 0.0633469 -0.2316053 0.2393998 0.9768386 -0.429323 0.0017483 -0.0550454 0.9404256 0.0120571 -0.1816329 0.2112531 0.0139544 -1.0060696 -0.2521135 -0.027105 -0.1322849 -0.3279605 0.0237501 -0.0031871 -0.0356389 0.0033358 1.737042 0.1117787 0.0081808 0.5394021 0.3585997 0.0120976 0.0480053 0.0526112 0.1396879 -0.8352873 0.1777919 -0.0012436 0.2516791 -0.0706003 0.048626 0.0296432 0.0521106 -0.15847 0.5473822 0.0915148 -0.0160752 -0.1649607 -0.0247363 0.0230642 0.0389833 0.0260149 -0.0673157 -0.4820088 -0.1568727 -0.0103133 -0.5342567 -0.2304538 0.0203505 -0.0533331 -0.0017803 -0.2123247 0.4368682 -0.2550132 0.1079693 -0.2020219 0.4721726 -0.1662635 0.2259283 -0.3485141 0.4218238 0.8416044 -0.0959594 -0.0157005 -0.457809 0.2805186 -0.0003792 -0.0688842 -0.0042872 0.3141188 0.0942181 -0.0245106 0.0017893 -0.0311247 0.0111592 -0.0255104 0.0118365 -0.0283606 0.1670079 0.1053335 -0.043487 -0.0061351 0.0009721 0.0411317 -0.0224766 -0.0200542 -0.0111795 0.1619899 -0.0084618 0.0775688 0.0139019 0.0874884 0.0290297 -0.0212719 0.0069448 -0.0279165 0.1668177 -0.0476139 -0.0911748 0.1155461 -0.008317 -0.0029875 0.087955 0.0056265 0.152319 -0.0442946 0.0167779 -0.0044774 -0.0804052 -0.1062194 0.0745419 -0.0901237 -0.0781414 -0.0147492 0.0096556 0.0259433 0.1198071 0.0258399 0.1231398 -0.0451774 -0.0273814 0.0453464 -0.0587375 0.0496846 -0.1051645 -0.0570837 -0.005971 -0.1079628 0.0477696 -0.0091119 -0.0113315 -0.0098579 0.1269288 0.0232798 -0.0189712 0.0463468 0.1613257 -0.0341855 0.1089174 -0.0012016 0.1048394 -0.0460934 0.022628 -0.0072148 -0.0520011 0.1525585 0.0144098 -0.095686 0.0388465 -0.0901152 -0.1007391 unknown
polarizability: 178.5435832|-1.6135336|123.1914333|1.6979573|-0.6876092|54.9658989 unknown
InChI: InChI=1S/C8H9NO4/c1-12-6-3-4-7(9(10)11)8(5-6)13-2/h3-5H,1-2H3
charge 0 multiplicity 1
22 atoms
O  1.324125 -1.826689 -0.442522
O  -3.250776 -0.578155 -0.051259
O  2.417327 2.295677 -0.193596
O  3.138119 0.187593 0.279902
N  2.195511 1.038638 0.036097
C  0.425599 -0.795924 -0.150481
C  0.80001 0.578035 0.030151
C  -1.937439 -0.119732 -0.01381
C  -0.945162 -1.116438 -0.176569
C  -0.198576 1.570163 0.173319
C  -1.561766 1.239571 0.166981
C  1.969578 -2.507977 0.704333
C  -4.332135 0.408424 0.085014
H  -1.244201 -2.153362 -0.350492
H  0.126631 2.608109 0.286214
H  -2.308178 2.027669 0.292307
H  1.198959 -2.955055 1.361684
H  2.606472 -1.800889 1.260194
H  2.586078 -3.298095 0.251646
H  -5.259441 -0.177809 0.0195
H  -4.298288 1.150507 -0.73453
H  -4.281445 0.922238 1.063418
