program: Gaussian 09
title: 000078624
version: EM64L-G09RevD.01
frameworkgroup: C1[X(C11H14)]
method: RPBEPBE
basis: SDD
operation: Freq
keyword: #p
keyword: freq=noraman
keyword: PBEPBE/SDD
title: #p freq=noraman PBEPBE/SDD
converged: YES YES NO NO
title: Mulliken charges:
elementType: C C C C C C C C C C C H H H H H H H H H H H H H H
charge: 0.192911 -0.488644 0.304183 -0.582911 0.278926 -0.726595 -0.747008 -0.435310 -0.419731 -0.242095 -0.234645 0.219104 0.212560 0.226983 0.225497 0.227801 0.217121 0.210904 0.222125 0.214167 0.207065 0.235220 0.238090 0.221840 0.222443
chargesum: 0.00000
title: Mulliken charges with hydrogens summed into heavy atoms:
elementType: C C C C C C C C C C C
charge: 0.192911 -0.056980 0.304183 -0.130431 0.278926 -0.070770 -0.103650 -0.200090 -0.181641 -0.020254 -0.012202
polarizability: 1.38533110e+02 1.45049038e+00 1.19951703e+02 -1.22362847e-01 -3.82718625e-02 7.40184193e+01
1716.lowfreq: -21.4776 -12.0345 -0.0006 -0.0003 0.0006 6.6581 93.0414 122.7864 206.2781
frequency: 92.9367 122.7581 206.2738 212.8974 236.1913 264.7041 293.5554 323.9553 372.5746 432.2803 448.2264 528.8843 535.7823 554.0695 607.7364 697.8601 727.4709 765.8172 773.7548 823.6021 872.0626 894.0422 919.6025 939.4877 941.3837 970.9533 984.1926 994.8477 1021.9596 1023.3364 1074.0046 1101.2726 1110.5318 1160.4982 1168.6029 1192.9429 1204.3675 1220.0227 1265.4240 1272.6649 1296.8419 1311.9397 1373.9183 1386.8628 1392.9595 1444.1236 1455.2199 1461.7960 1465.0609 1470.8635 1476.3961 1479.1971 1485.8958 1594.4354 1615.6779 2967.2475 2970.4391 2975.3098 2992.6087 3041.6135 3058.7740 3062.1280 3065.9757 3071.6057 3073.9836 3113.8224 3119.9258 3135.1662 3156.1064
redmass: 2.9884 2.7667 2.0223 1.1327 1.7474 1.3122 2.6653 2.3325 2.4398 2.7498 3.0170 3.8537 4.2112 3.0926 3.6761 3.7902 2.4490 1.3696 2.4445 3.5454 1.3509 1.8640 1.8376 1.6087 1.3953 1.6435 1.3177 1.8124 2.1423 1.6442 2.7908 1.4107 1.7602 1.4594 1.1017 2.1370 2.0883 1.9853 1.3876 2.3751 1.6173 1.6670 1.2003 6.7247 1.2098 2.3030 1.1412 1.1082 1.2750 1.1904 1.3141 1.0659 1.1626 6.9167 7.0017 1.0349 1.0357 1.0641 1.0628 1.0953 1.1008 1.1018 1.0995 1.1001 1.0994 1.0853 1.0892 1.0939 1.1002
irintensity: 0.0075 0.9424 1.1884 0.0600 0.6500 0.0361 1.8409 0.4743 0.1387 6.1216 4.1690 0.4401 0.3948 3.3391 0.5023 0.7128 11.5649 72.4365 1.5413 1.8039 0.1230 1.3523 0.3675 2.6219 1.0484 2.2631 0.0636 3.1359 6.9824 1.8007 7.8012 1.3016 10.9565 2.5867 0.2673 0.6581 1.4620 2.5657 1.5865 5.5441 0.3071 11.3089 19.7742 5.3986 8.6871 6.1972 2.3706 4.9711 14.0027 2.7183 12.6429 9.8880 20.3888 0.5800 1.1914 28.7635 36.5821 33.9329 40.8855 29.5097 14.2343 14.0155 62.6817 48.5695 53.4319 7.4060 3.5695 37.0180 35.5274
temp: 298.150 k
press: 1.00000 atm
elementType: 6 6 6 6 6 6 6 6 6 6 6 1 1 1 1 1 1 1 1 1 1 1 1 1 1
symmnumber: 1
zpe: 567445.2 jmol-1
zpe.correction: 0.216128 hartree
zpe.thermalcorrener: 0.226104 hartree
zpe.thermalcorrenthalpy: 0.227049 hartree
zpe.thermalcorrgfe: 0.181630 hartree
zpe.sumelectzpe: -426.763854 hartree
zpe.sumelectthermal: -426.753878 hartree
zpe.sumelectthermalent: -426.752934 hartree
zpe.sumelectthermalfe: -426.798353 hartree
dipole: 0.6194 0.2808 0.0594
dipole: 0.6826
quadrupole: -63.1185 -62.2236 -70.1185
quadrupole: 0.1105 0.0354 -0.1269
quadrupole: 2.0350 2.9299 -4.9649 0.1105 0.0354 -0.1269
hfenergy: -426.9799826 hartree
pointgroup: C01 [X(C11H14)]
dipole: 0.245524 -0.1063364 -0.023265 debye
dipolederiv: 0.1251193 0.0332449 0.011983 -0.0166311 0.1123403 0.0208391 0.0775625 0.0161101 0.1612135 0.0924399 -0.053733 -0.0539663 -0.0607791 -0.034127 0.0113437 0.0142762 0.0076501 0.0910372 0.2228671 0.0193643 -0.0351357 0.1464319 -0.1845096 -0.0102495 -0.0686319 -0.0194692 -0.1067083 -0.0120361 0.0224545 -0.0341885 0.0526363 0.0059997 -0.0291691 0.008339 -0.0601583 0.1602719 -0.0356857 -0.1458729 -0.0014195 -0.2601328 0.138349 -0.002892 -0.0645963 0.0459074 -0.0549609 -0.0303592 -0.016165 0.0350025 -0.0016662 0.0385455 0.002944 -0.0424212 0.0000365 -0.0596578 0.0055125 -0.0328215 -0.0203133 -0.0084004 0.0061531 -0.0465522 -0.0049066 -0.0445343 0.0003308 -0.0830617 0.0202071 0.0113793 0.0396138 0.0916561 0.0120202 0.01474 0.0090163 -0.1510061 -0.02941 0.1152454 -0.0004984 0.0903715 0.0613981 0.0049745 0.015691 0.0010739 -0.1583544 -0.028912 -0.0319291 0.0011207 -0.0973671 0.0424945 0.001007 0.0014619 0.0011081 -0.1670959 0.0529834 -0.0022627 0.0033058 0.066231 -0.0530155 -0.0005687 0.0044406 -0.0055547 -0.1691014 0.0653044 -0.0174306 0.0007708 -0.0242082 0.0540418 -0.0030768 -0.0583345 0.0324267 -0.1816971 -0.1697719 0.088851 0.0496826 0.0763057 0.0315867 -0.024001 0.0932669 -0.0500918 0.0547025 0.0247105 -0.0489785 0.0250698 -0.0131731 -0.1039233 0.0878036 -0.0023989 0.1459526 0.018276 0.0040308 0.0630501 0.0198037 0.0388097 0.0198693 -0.0653746 0.0262619 -0.1230497 -0.1120315 0.0664728 -0.066795 -0.0697741 -0.0478393 -0.0248871 -0.1326519 -0.0594988 -0.0845717 -0.0283523 0.0811581 0.0750262 -0.0194969 0.0378847 -0.1223929 0.1044562 -0.0066442 0.047735 0.0446698 -0.2304005 -0.0029134 0.0502383 0.0167187 0.0898407 0.0080518 0.0315251 0.0142218 0.0606449 0.0722464 -0.0066361 0.0923465 -0.0156778 0.0695563 0.037644 0.0587465 0.0019206 -0.1439709 -0.2132728 -0.010365 -0.0323525 0.0394536 0.0776083 -0.007164 -0.0041187 -0.0157602 0.0821252 0.0918463 0.0682429 -0.0217272 0.0078755 -0.1561736 0.038952 -0.0215555 0.0819195 0.0535193 0.0589701 -0.0981221 -0.0038789 -0.0708314 -0.0854561 -0.0051432 -0.0025138 -0.0030989 0.1397574 0.0454972 -0.0597555 -0.0024276 -0.0942882 -0.0991815 -0.0024856 -0.0065026 0.0016734 0.1504076 -0.0196785 0.1080482 -0.0012477 0.1206723 -0.0578745 -0.0000903 -0.0018658 -0.0016806 0.1575952 -0.1565705 -0.0199542 -0.0042766 -0.0220099 0.0821015 -0.0006171 -0.002323 0.0012178 0.1583854 unknown
polarizability: 138.5722072|-1.156617|119.9066927|0.410188|0.3971331|74.024333 unknown
InChI: InChI=1S/C11H14/c1-11(2)8-7-9-5-3-4-6-10(9)11/h3-6H,7-8H2,1-2H3
charge 0 multiplicity 1
25 atoms
C  1.553707 0.295976 0.017685
C  1.817171 -1.187079 0.461995
C  0.017488 0.349263 0.028201
C  0.57071 -2.002313 0.001526
C  -0.538162 -0.956736 0.007346
C  2.070861 0.535803 -1.431621
C  2.208948 1.313422 0.98011
C  -0.823016 1.480651 0.01234
C  -1.93517 -1.141093 -0.021734
C  -2.228059 1.298824 -0.012082
C  -2.781327 -0.004259 -0.028624
H  1.884456 -1.221999 1.566601
H  2.764873 -1.581229 0.052378
H  0.358531 -2.864184 0.659699
H  0.714556 -2.406362 -1.021273
H  1.653688 -0.208953 -2.134158
H  1.778042 1.539146 -1.792934
H  3.174787 0.466188 -1.466917
H  1.818968 1.196018 2.007718
H  3.305876 1.170567 1.008483
H  2.017053 2.354551 0.658504
H  -0.401685 2.493187 0.029283
H  -2.366107 -2.149574 -0.033527
H  -2.892191 2.170948 -0.014562
H  -3.869898 -0.132462 -0.04284
