program: Gaussian 09
title: 000078619
version: EM64L-G09RevD.01
frameworkgroup: C1[X(C8H7ClO2)]
method: RPBEPBE
basis: SDD
operation: Freq
keyword: #p
keyword: freq=noraman
keyword: PBEPBE/SDD
title: #p freq=noraman PBEPBE/SDD
converged: NO YES NO NO
title: Mulliken charges:
elementType: Cl O O C C C C C C C C H H H H H H H
charge: -0.017230 -0.234136 -0.212484 0.442059 0.407263 -0.263530 -0.313810 -0.362964 -0.377179 -0.205375 -0.535166 0.251812 0.261791 0.274396 0.167622 0.230097 0.230095 0.256739
chargesum: 0.00000
title: Mulliken charges with hydrogens summed into heavy atoms:
elementType: Cl O O C C C C C C C C
charge: -0.017230 -0.234136 -0.212484 0.442059 0.407263 -0.263530 -0.061999 -0.101172 -0.102783 -0.037753 0.181765
polarizability: 1.66092468e+02 -1.03813938e+00 1.12839003e+02 -8.13386758e-04 1.39768728e-03 4.41452432e+01
1716.lowfreq: -10.3128 -5.1594 -0.0025 -0.0022 -0.0014 3.5323 77.5727 113.3300 134.6662
frequency: 77.5388 113.3257 134.6654 156.0090 176.0227 230.1170 236.9696 294.0502 337.5139 344.5408 391.1412 448.3086 537.6775 564.0325 606.0927 681.5280 733.0082 747.0549 825.4572 870.1935 885.8246 966.1570 978.6281 994.9470 1033.7719 1110.5990 1136.1819 1165.0545 1201.6299 1255.3852 1273.4662 1348.0734 1396.4876 1413.8059 1436.5260 1468.9866 1470.5964 1489.4810 1555.9238 1596.5408 1623.5437 2872.7585 2973.1979 3067.2506 3141.0968 3143.6833 3150.1493 3171.7301
redmass: 4.3516 4.4666 4.2865 6.5716 6.8708 1.2732 2.3950 4.4729 3.7889 8.8743 9.2762 3.2837 4.6340 3.6335 7.3488 6.9524 3.6774 5.3159 1.4421 5.7541 1.3996 1.4156 8.7024 1.6906 2.9626 1.2581 1.3276 1.2858 1.9283 3.5408 1.7939 2.2576 1.8055 4.9981 1.2462 1.1084 1.0497 2.5431 8.3166 6.2122 7.4337 1.0849 1.0326 1.1047 1.1001 1.0922 1.0883 1.0957
irintensity: 0.0453 15.2978 2.1326 9.6890 1.7004 0.6488 6.9295 0.7186 3.6795 1.9234 2.8188 2.4758 14.7863 6.6732 22.2764 42.4853 2.3796 12.6772 49.4216 29.2404 12.7228 1.6304 46.1837 8.2294 44.6642 0.0886 27.3858 6.0883 84.8465 279.6859 55.3432 30.0262 23.9137 3.7312 10.8247 73.0084 16.1056 40.9982 72.1435 337.0212 54.3123 123.2819 54.2901 37.8462 15.0838 1.2975 0.2637 8.4293
temp: 298.150 k
press: 1.00000 atm
elementType: 17 8 8 6 6 6 6 6 6 6 6 1 1 1 1 1 1 1
symmnumber: 1
zpe: 339899.3 jmol-1
zpe.correction: 0.129461 hartree
zpe.thermalcorrener: 0.139813 hartree
zpe.thermalcorrenthalpy: 0.140757 hartree
zpe.thermalcorrgfe: 0.093040 hartree
zpe.sumelectzpe: -918.734667 hartree
zpe.sumelectthermal: -918.724315 hartree
zpe.sumelectthermalent: -918.723371 hartree
zpe.sumelectthermalfe: -918.771088 hartree
dipole: 3.3785 -2.1517 0.0001
dipole: 4.0055
quadrupole: -84.5898 -60.0279 -72.3647
quadrupole: -15.0254 0.0022 0.0003
quadrupole: -12.2623 12.2996 -0.0373 -15.0254 0.0022 0.0003
hfenergy: -918.8641278 hartree
pointgroup: C01 [X(C8H7Cl1O2)]
dipole: -1.3946461 -0.7337195 -0.0000514 debye
dipolederiv: -0.3191515 0.304536 0.0000761 0.3659716 -0.508196 -0.0001085 0.0000819 -0.0000918 -0.0412714 -1.7234999 -0.5969981 -0.0000219 -0.4016889 -0.4287928 -0.0000054 0.0000792 -0.0000075 -0.2713618 -1.2361891 0.106356 0.0000775 0.5768144 -0.500526 -0.0000441 0.0003396 -0.0000824 -0.3353541 1.5210851 0.5820049 0.0000058 0.1735405 -0.0256317 -0.0000736 -0.0001363 -0.0001003 0.1410446 -1.0929922 -0.1090244 0.0001007 -0.284011 -0.1790772 0.0000127 0.0000756 0.0000088 -0.0065903 0.0597861 -0.6419744 -0.000132 -0.9301486 0.6389582 0.0002029 -0.0001955 0.0001576 -0.0942608 -0.4723744 -0.1123701 -0.000007 0.3337796 0.0311468 0.0000066 0.000097 0.0000415 -0.1913742 0.2779231 0.1704674 0.0000011 -0.069379 -0.0885255 -0.0000039 -0.0000861 -0.0000246 -0.0987219 0.2680517 0.0742493 -0.0000074 0.2012927 0.1082326 0.0000021 -0.0000308 0.000018 -0.0970571 1.9486507 0.0006493 -0.0002012 -0.0758071 0.7034354 0.0000256 -0.0003611 0.0000504 0.102353 0.5522246 0.213589 0.0000293 0.5584238 0.5579572 0.0000121 0.0001299 0.0000475 0.3142762 0.0430796 -0.0670976 0.0000067 -0.073781 -0.0479557 -0.000022 0.0000138 -0.000022 0.1662718 0.0838767 -0.0706046 -0.0000031 -0.0329053 -0.0045475 -0.0000199 0.0000093 -0.0000167 0.1616622 0.0714841 0.0740547 0.0000135 0.0331068 0.0284056 -0.0000162 0.0000023 -0.0000272 0.1574312 0.010296 -0.0043725 0.0000208 -0.1679219 -0.263958 -0.0000096 0.0000435 0.0000237 0.1089373 0.0666017 0.0477229 -0.086262 -0.1210343 -0.0524167 0.0787878 -0.0193736 0.0990033 -0.0727641 0.0665815 0.0477117 0.0863305 -0.1210142 -0.0523114 -0.0787481 0.0193319 -0.0989743 -0.0728184 -0.1254339 -0.0188995 -0.0000275 0.0347619 0.0838027 0.0000014 -0.0000206 -0.000004 0.1295975 unknown
polarizability: 165.8994069|-3.3647517|113.0320607|-0.0119293|0.0116881|44.1452462 unknown
InChI: InChI=1S/C8H7ClO2/c1-11-8-3-2-6(5-10)4-7(8)9/h2-5H,1H3
charge 0 multiplicity 1
18 atoms
Cl -1.773774 2.503872 0.000665
O  -2.630605 -0.3217 0.000307
O  3.894743 -0.607258 -0.000546
C  -1.246628 -0.245978 0.00019
C  1.574502 0.114013 0.000014
C  -0.677028 1.060197 0.000341
C  -0.375322 -1.37197 -0.000036
C  0.709598 1.24277 0.000248
C  1.016806 -1.190724 -0.000124
C  3.039822 0.320491 -0.000074
C  -3.253398 -1.653045 -0.000128
H  -0.792394 -2.38292 -0.000128
H  1.124472 2.257055 0.000354
H  1.699539 -2.047063 -0.000289
H  3.361705 1.393123 -0.000199
H  -2.974998 -2.223039 0.906201
H  -2.974747 -2.222568 -0.906675
H  -4.333992 -1.454657 -0.000221
