program: Gaussian 09
title: 000078620
version: EM64L-G09RevD.01
frameworkgroup: C1[X(C15H13NO)]
method: RPBEPBE
basis: SDD
operation: Freq
keyword: #p
keyword: freq=noraman
keyword: PBEPBE/SDD
title: #p freq=noraman PBEPBE/SDD
converged: YES YES NO NO
title: Mulliken charges:
elementType: O N C C C C C C C C C C C C C C C H H H H H H H H H H H H H
charge: -0.224214 -0.245751 0.220600 0.376474 -0.695906 0.209941 0.188465 0.121948 -0.316973 -0.403676 -0.703653 -0.335261 -0.351150 -0.248730 -0.247098 -0.246172 -0.260436 0.243432 0.250831 0.242763 0.243741 0.221977 0.252173 0.256585 0.246262 0.280782 0.228744 0.231482 0.227629 0.235193
chargesum: 0.00000
title: Mulliken charges with hydrogens summed into heavy atoms:
elementType: O N C C C C C C C C C C C C C C C
charge: -0.224214 -0.245751 0.220600 0.376474 -0.201643 0.209941 0.188465 0.121948 -0.074210 -0.159935 0.027081 -0.088999 -0.070368 -0.019986 -0.015617 -0.018543 -0.025243
polarizability: 2.36412006e+02 4.51765384e+00 1.85912456e+02 5.08599314e-02 2.73744427e+00 9.64407088e+01
1716.lowfreq: -5.4903 -0.0007 -0.0006 -0.0004 8.2288 12.5765 50.6901 78.8940 115.2884
frequency: 50.6823 78.8853 115.2851 123.9849 164.2612 225.8904 276.6469 290.8313 305.7953 325.6643 353.0499 359.1919 401.2920 429.5714 449.2961 478.0285 509.8692 540.2522 551.8436 573.6401 591.0511 607.6304 657.1565 697.7066 740.0692 747.8112 756.3055 767.5831 768.5107 829.2457 862.1407 864.5372 874.2527 937.1635 951.7844 967.8033 983.3187 996.5651 1016.8421 1036.2623 1045.6246 1057.6141 1107.9353 1114.8536 1120.3872 1128.7761 1156.7622 1175.5743 1180.4400 1208.0066 1233.0200 1253.1217 1262.9533 1279.8147 1301.8114 1333.3808 1380.3153 1387.3493 1430.9393 1441.0019 1444.7710 1450.0065 1470.4804 1480.4950 1489.3887 1502.0080 1564.1187 1574.7131 1593.6087 1606.8416 1616.3311 2950.6847 2987.0803 3053.2622 3097.1409 3110.3458 3129.1554 3131.0782 3137.4948 3146.0042 3151.6880 3165.2918 3167.1984 3180.1669
redmass: 5.4698 5.0043 4.4347 3.5426 3.4332 4.7530 4.1474 1.8746 3.5839 2.1965 2.7891 4.2796 4.5268 3.6690 3.5901 3.2162 4.0193 4.0995 4.2579 3.8766 4.6606 6.0243 5.3572 3.7711 3.2030 3.4730 3.3173 1.5684 1.5189 3.0891 1.7278 1.5518 2.9186 1.7207 1.6871 1.3867 1.3251 1.3586 4.1069 4.7473 2.4092 2.0867 1.3298 2.0688 1.7904 1.4981 1.2404 1.0631 1.1257 2.1949 2.8928 2.4128 1.3948 2.0279 1.6448 2.4036 9.7393 7.8785 2.0222 1.5074 1.3856 1.4310 2.2767 1.1321 2.3540 1.1030 7.2614 8.1155 7.1775 6.5713 6.4119 1.0458 1.0642 1.0888 1.0978 1.1000 1.0851 1.0865 1.0897 1.0898 1.0943 1.0970 1.1008 1.0948
irintensity: 1.4911 0.0637 2.1529 1.0542 1.8069 0.5454 4.9849 1.1813 2.7530 2.0715 0.6440 5.6736 4.3867 1.3960 3.5332 4.3783 4.9543 9.1197 6.2006 8.7179 12.1031 1.8488 0.3609 1.9444 8.2089 9.1272 10.2005 104.4316 44.9335 3.1260 4.8249 4.8844 5.1447 2.6661 3.9832 2.0417 0.1902 0.6588 13.1439 10.8479 19.3280 6.5646 11.9947 24.0178 13.9563 20.7100 22.2023 0.1657 6.1079 3.0633 56.8625 23.7565 5.4113 36.1541 13.0290 128.5922 5.8526 4.7473 29.6896 18.9156 12.5131 33.9092 222.8579 46.5042 22.0631 31.2861 8.8486 217.9283 34.9494 27.7982 80.9636 69.3584 12.3144 25.1163 9.1953 15.2020 0.7724 7.6941 6.5866 2.4247 23.4734 25.9413 24.7583 17.2069
temp: 298.150 k
press: 1.00000 atm
elementType: 8 7 6 6 6 6 6 6 6 6 6 6 6 6 6 6 6 1 1 1 1 1 1 1 1 1 1 1 1 1
symmnumber: 1
zpe: 628378.8 jmol-1
zpe.correction: 0.239337 hartree
zpe.thermalcorrener: 0.252514 hartree
zpe.thermalcorrenthalpy: 0.253458 hartree
zpe.thermalcorrgfe: 0.199977 hartree
zpe.sumelectzpe: -708.191057 hartree
zpe.sumelectthermal: -708.177880 hartree
zpe.sumelectthermalent: -708.176936 hartree
zpe.sumelectthermalfe: -708.230418 hartree
dipole: 0.8800 -4.9013 0.9438
dipole: 5.0683
quadrupole: -87.5813 -98.9774 -100.0243
quadrupole: 4.9168 -0.4034 1.0166
quadrupole: 7.9464 -3.4497 -4.4967 4.9168 -0.4034 1.0166
hfenergy: -708.4303942 hartree
pointgroup: C01 [X(C15H13N1O1)]
dipole: -0.3547838 1.9348238 0.3267187 debye
polarizability: 236.3706395|4.740008|185.7792771|-0.1671359|-4.8052753|96.6152542 unknown
InChI: InChI=1S/C15H13NO/c1-16-13-8-4-2-6-11(13)10-15(17)12-7-3-5-9-14(12)16/h2-9H,10H2,1H3
charge 0 multiplicity 1
30 atoms
O  0.761811 -3.026459 0.109434
N  -0.065077 1.247894 0.577913
C  -1.317339 0.66972 0.156822
C  -1.64378 -0.669863 0.498154
C  -0.655253 -1.466204 1.320909
C  1.197522 0.700657 0.217841
C  1.446317 -0.707062 0.015681
C  0.539617 -1.820531 0.432178
C  -2.24881 1.456272 -0.571546
C  -2.870687 -1.218827 0.056497
C  -0.120531 2.663784 1.004463
C  2.288606 1.60251 0.005382
C  2.71577 -1.120838 -0.48402
C  -3.479875 0.90483 -0.982053
C  -3.792082 -0.440647 -0.676552
C  3.539543 1.155574 -0.452056
C  3.75839 -0.216312 -0.727664
H  -0.306356 -0.853445 2.175661
H  -1.096174 -2.403382 1.694711
H  -2.001483 2.487893 -0.842628
H  -3.106587 -2.258232 0.311158
H  0.025456 3.382787 0.171546
H  0.653377 2.854583 1.767565
H  -1.105089 2.853778 1.458758
H  2.148471 2.674982 0.156097
H  2.849421 -2.197442 -0.634889
H  -4.184649 1.518743 -1.553618
H  -4.744302 -0.87415 -0.99983
H  4.340712 1.88608 -0.613433
H  4.725457 -0.564991 -1.103079
