program: Gaussian 09
title: 000078636
version: EM64L-G09RevD.01
frameworkgroup: C1[X(C10H15O2P)]
method: RPBEPBE
basis: SDD
operation: Freq
keyword: #p
keyword: freq=noraman
keyword: PBEPBE/SDD
title: #p freq=noraman PBEPBE/SDD
converged: YES YES NO NO
title: Mulliken charges:
elementType: P O O C C C C C C C C C C H H H H H H H H H H H H H H H
charge: 1.111283 -0.689753 -0.639473 -0.079273 -0.688365 -0.665564 -0.681597 -0.192693 -0.299000 -0.255340 -0.213847 -0.227006 -0.222395 0.252053 0.216731 0.230823 0.250313 0.242149 0.208764 0.229114 0.220068 0.249581 0.383585 0.283635 0.271942 0.235685 0.234800 0.233781
chargesum: 0.00000
title: Mulliken charges with hydrogens summed into heavy atoms:
elementType: P O O C C C C C C C C C C
charge: 1.111283 -0.306168 -0.639473 -0.079273 0.011242 0.035661 0.017166 -0.192693 -0.015365 0.016602 0.021838 0.007794 0.011385
polarizability: 1.68884494e+02 3.13236958e+00 1.28356331e+02 7.74216206e+00 -1.01834376e+01 1.02586878e+02
1716.lowfreq: -9.2898 -5.1748 -0.0023 -0.0007 0.0012 3.3826 43.2334 45.7042 73.9626
frequency: 43.1913 45.5793 73.9530 129.5247 170.2888 178.1621 196.1314 212.5535 238.2946 248.4940 256.1791 260.8100 269.8376 289.8398 342.0518 355.4057 383.1631 401.3636 417.1626 467.0996 494.6231 571.1079 610.8449 661.6568 697.3445 707.5882 765.5332 800.6810 866.4155 939.3404 940.4930 942.7331 960.1891 973.3270 986.8896 987.8013 1005.6360 1009.6807 1017.2942 1021.1343 1035.7908 1078.6938 1092.8283 1173.7843 1187.5681 1193.3669 1219.9132 1230.5575 1309.9214 1376.8729 1377.3872 1379.1117 1403.7360 1425.9368 1453.0196 1464.2760 1468.6479 1471.6330 1476.8722 1478.8530 1497.7952 1586.5166 1595.9696 2974.2649 2976.2084 2980.6211 3065.3500 3070.3861 3076.4463 3082.2023 3091.9342 3096.9317 3128.1412 3136.2196 3146.1783 3156.0635 3167.7787 3591.9830
redmass: 3.2699 3.5383 4.1230 5.4802 4.0864 3.9056 1.1141 1.4648 2.0500 3.0857 1.7645 1.2728 2.1476 1.9719 3.6125 3.0340 3.0275 2.8170 3.3958 4.4818 3.3218 4.5471 6.4620 9.3452 7.6440 1.8963 1.6850 2.9663 1.2411 1.3731 1.6283 1.5421 1.2200 2.0659 3.0611 1.7362 1.3295 1.7888 1.4463 2.6254 1.8931 1.6600 2.8033 1.0556 1.1579 1.9813 2.8754 2.9455 1.3219 1.2636 1.1884 6.0210 1.1937 2.1140 1.0464 2.0046 1.0494 1.0567 1.0508 1.0506 1.0541 6.0904 5.8391 1.0351 1.0356 1.0361 1.0989 1.0993 1.0988 1.1002 1.1004 1.1000 1.0851 1.0882 1.0927 1.0965 1.1016 1.0660
irintensity: 0.1787 0.9602 0.2454 1.0324 1.5896 7.4857 3.0210 46.4260 4.1437 15.0702 12.1980 0.7824 9.2546 61.3973 0.8704 22.2389 7.0113 0.3911 2.0241 57.0374 18.7990 62.1658 1.6108 119.2079 59.3060 79.5801 29.3189 11.5147 0.1535 1.4017 3.5707 1.8520 0.5347 23.9483 0.8185 0.7238 0.3804 22.2063 9.0772 1.7721 91.0118 1.9609 45.9287 0.0654 9.8341 34.0032 1.5148 1.2375 3.0361 23.1176 20.8771 2.9880 16.4679 18.9636 0.5797 8.3530 0.8389 1.7948 13.6030 14.5764 29.1889 0.1021 0.4374 16.8116 25.3914 37.3543 10.6796 35.5173 33.5062 15.2051 11.6092 21.0810 0.1288 4.4692 6.0813 18.6839 26.9832 43.3075
temp: 298.150 k
press: 1.00000 atm
elementType: 15 8 8 6 6 6 6 6 6 6 6 6 6 1 1 1 1 1 1 1 1 1 1 1 1 1 1 1
symmnumber: 1
zpe: 596094.2 jmol-1
zpe.correction: 0.227040 hartree
zpe.thermalcorrener: 0.241922 hartree
zpe.thermalcorrenthalpy: 0.242866 hartree
zpe.thermalcorrgfe: 0.185738 hartree
zpe.sumelectzpe: -880.742330 hartree
zpe.sumelectthermal: -880.727447 hartree
zpe.sumelectthermalent: -880.726503 hartree
zpe.sumelectthermalfe: -880.783632 hartree
dipole: 1.8002 2.9123 1.1666
dipole: 3.6171
quadrupole: -76.7033 -92.1631 -82.5198
quadrupole: -3.0962 -1.2373 -3.0251
quadrupole: 7.0921 -8.3677 1.2756 -3.0962 -1.2373 -3.0251
hfenergy: -880.9693698 hartree
pointgroup: C01 [X(C10H15O2P1)]
dipole: 0.7451992 0.5408634 1.0850171 debye
polarizability: 169.4164203|-2.1312592|126.7083908|5.2835329|12.0862004|103.7028923 unknown
InChI: InChI=1S/C10H15O2P/c1-10(2,3)13(11,12)9-7-5-4-6-8-9/h4-8,11H,1-3H3
charge 0 multiplicity 1
28 atoms
P  -1.016442 -0.027934 -0.773109
O  -1.360534 1.640193 -1.224156
O  -1.324547 -1.118994 -1.911329
C  -2.131549 -0.162912 0.776136
C  -1.812925 0.971542 1.774878
C  -3.593007 -0.071089 0.27235
C  -1.853893 -1.553654 1.399322
C  0.790331 0.013819 -0.312351
C  1.55911 -1.149155 -0.558255
C  1.392416 1.17276 0.233908
C  2.935557 -1.156591 -0.239036
C  2.769689 1.158752 0.550242
C  3.539481 -0.005778 0.31958
H  -1.947915 1.964045 1.311257
H  -2.505342 0.89326 2.634885
H  -0.782554 0.898214 2.167577
H  -3.794747 -0.82756 -0.50705
H  -3.808445 0.9274 -0.145573
H  -4.2783 -0.252345 1.122073
H  -0.808751 -1.649284 1.747804
H  -2.516597 -1.69318 2.273827
H  -2.059207 -2.364925 0.677903
H  -1.21133 1.811896 -2.188635
H  1.08088 -2.021433 -1.018081
H  0.796879 2.079494 0.383626
H  3.534955 -2.05318 -0.430787
H  3.241424 2.054333 0.969247
H  4.607564 -0.012596 0.564649
