program: Gaussian 09
title: 000078613
version: EM64L-G09RevD.01
frameworkgroup: C1[X(C11H9NO3)]
method: RPBEPBE
basis: SDD
operation: Freq
keyword: #p
keyword: freq=noraman
keyword: PBEPBE/SDD
title: #p freq=noraman PBEPBE/SDD
converged: NO YES NO NO
title: Mulliken charges:
elementType: O O O N C C C C C C C C C C C H H H H H H H H H
charge: -0.252230 -0.224084 -0.228329 0.018317 0.293326 0.232281 0.219483 0.164239 -0.373453 -0.380244 -0.421445 -0.370923 -0.232705 -0.227279 -0.530865 0.308800 0.277898 0.287543 0.252661 0.234975 0.235659 0.252506 0.231951 0.231920
chargesum: 0.00000
title: Mulliken charges with hydrogens summed into heavy atoms:
elementType: O O O N C C C C C C C C C C C
charge: -0.252230 -0.224084 -0.228329 0.018317 0.293326 0.232281 0.219483 0.164239 -0.064654 -0.102347 -0.133902 -0.118262 0.002270 0.008380 0.185512
polarizability: 2.04149123e+02 7.06489564e-01 1.88629593e+02 -5.47636315e-02 3.94542760e-01 5.69027365e+01
1716.lowfreq: -5.1093 -1.8604 -0.0009 -0.0009 -0.0005 6.0901 17.0094 76.5815 97.3343
frequency: 16.9142 76.5780 97.3281 140.3134 189.2361 200.5196 234.2701 236.7650 306.9529 326.6082 360.6282 402.7924 417.7018 461.4905 470.1023 554.5374 563.2939 596.6620 621.7928 651.6340 687.9383 700.8610 752.2172 776.0336 783.8611 795.3285 832.0655 899.5930 925.6720 976.1302 978.8892 988.9324 1011.7485 1037.2924 1075.8483 1114.8046 1142.4179 1152.6904 1169.1642 1176.3780 1196.8531 1197.3370 1249.9564 1273.9378 1338.3476 1369.1397 1394.1913 1415.2710 1436.7346 1439.2244 1453.0460 1471.2829 1473.0839 1523.8398 1578.1732 1586.0268 1625.4476 2975.6762 3070.7009 3136.6845 3138.5183 3156.1160 3169.8490 3179.4518 3187.5637 3213.8918
redmass: 13.7574 4.6107 3.6551 3.8160 3.9910 4.4575 1.1519 6.3649 6.5906 4.8575 7.4465 6.9536 3.2767 6.1741 3.4203 7.1060 4.2520 5.3753 6.8366 3.3215 6.4731 5.7472 10.2954 1.9270 5.2526 2.0616 1.5261 1.4699 6.8637 1.4679 4.9394 1.3640 1.3280 2.4928 3.4054 1.2573 1.6270 1.6104 2.1365 1.3146 1.4113 3.8214 2.1069 2.0824 5.7434 2.5974 4.2080 7.7863 1.4113 2.4814 1.8897 1.0490 1.0786 4.3618 6.0073 7.3611 6.8211 1.0323 1.1046 1.0872 1.1007 1.0932 1.0882 1.0967 1.0953 1.0934
irintensity: 0.0311 0.1961 6.6112 6.2116 3.9137 0.0137 0.5211 3.2260 0.2491 0.0811 1.5326 4.0535 5.3283 2.8964 0.0247 0.7451 6.1705 7.7781 14.0495 1.0816 4.2299 14.3285 9.6480 60.4845 1.8537 49.4273 35.8395 0.1678 5.2122 7.7106 34.6932 3.5793 0.9790 20.1980 103.5202 0.0512 17.2677 10.8520 43.9010 102.5359 7.1992 471.8209 120.4315 51.8514 72.6418 15.7985 72.9565 5.6487 4.1676 5.1078 35.9615 16.0452 39.6047 72.9544 120.8965 75.7746 15.3217 61.0899 34.8344 6.9602 16.4152 17.7800 6.0909 9.2254 5.7608 11.0669
temp: 298.150 k
press: 1.00000 atm
elementType: 8 8 8 7 6 6 6 6 6 6 6 6 6 6 6 1 1 1 1 1 1 1 1 1
symmnumber: 1
zpe: 467466.7 jmol-1
zpe.correction: 0.178049 hartree
zpe.thermalcorrener: 0.190378 hartree
zpe.thermalcorrenthalpy: 0.191323 hartree
zpe.thermalcorrgfe: 0.138220 hartree
zpe.sumelectzpe: -703.848211 hartree
zpe.sumelectthermal: -703.835881 hartree
zpe.sumelectthermalent: -703.834937 hartree
zpe.sumelectthermalfe: -703.888040 hartree
dipole: 7.2305 -0.1904 -0.0112
dipole: 7.2330
quadrupole: -91.1877 -74.0050 -89.0772
quadrupole: -14.0964 0.0769 -0.3616
quadrupole: -6.4311 10.7516 -4.3205 -14.0964 0.0769 -0.3616
hfenergy: -704.0262597 hartree
pointgroup: C01 [X(C11H9N1O3)]
dipole: -2.8190151 0.338915 0.1901037 debye
dipolederiv: -1.8451431 0.6200512 0.15945 0.2650708 -0.463168 -0.0368308 0.1203474 -0.0571059 -0.2854645 -0.8327916 -0.3097901 0.009449 -0.5312306 -0.7666095 0.0012826 -0.0042779 -0.0114593 -0.2441925 -0.8108105 0.1542162 0.0350667 0.3756426 -0.6255079 -0.0350027 0.0572036 -0.0275213 -0.2451792 2.1978832 0.2109105 -0.0854202 0.1284056 1.0465255 0.0211222 -0.1021746 0.025548 0.194066 0.0444137 -0.0847622 -0.0091513 0.3202468 0.2894918 0.0100516 0.0238345 0.0320397 0.0480726 -0.2896926 0.1975921 0.0394467 0.3319297 -0.1770527 -0.0411397 0.0520313 -0.032769 0.0124647 -1.0866586 -0.0214894 0.0578096 0.2468166 -0.0950974 -0.0148008 0.0867764 -0.0041036 -0.005175 1.7254824 -0.4663099 -0.1465465 0.3252609 0.3880074 0.0143219 -0.057584 0.059909 0.1104417 -0.0256996 -0.085487 -0.0164869 -0.2001392 -0.2873139 -0.0036561 -0.0278221 -0.0125995 -0.1474826 0.0266477 0.0655302 -0.0005054 -0.1805107 -0.0283003 0.0227885 -0.0280011 0.0083612 -0.1376945 0.6575495 -0.0537919 -0.0480785 -0.391593 -0.0476524 0.0246146 -0.0718805 0.0052529 -0.0722162 -0.7759193 -0.0389485 0.0268551 -0.5483915 -0.0835989 0.0470632 -0.0265493 0.0186858 -0.2089462 0.2066556 -0.0645153 -0.0261446 -0.0588744 0.1509321 0.0359917 -0.0220796 0.0363638 -0.1302214 -0.0809227 0.1150013 0.0093944 0.2380383 0.0220147 0.0071817 0.0222548 0.0129231 -0.1551068 0.6286353 -0.2345502 -0.0443886 -0.5831263 0.5354086 0.0588253 -0.0811586 0.038605 0.3161482 0.0581881 0.0835476 0.015662 -0.0171605 0.1576233 -0.0017224 0.0012406 -0.0049455 0.1700338 -0.0203883 -0.0188976 0.0073756 0.0284096 0.1164582 -0.0063076 0.0132235 -0.0032942 0.1581047 0.1026741 -0.0534657 -0.0029928 -0.0191737 0.0701985 -0.0103805 -0.0021933 -0.0056229 0.1614137 0.0396188 0.0745304 0.0162375 0.0828333 -0.0328134 -0.0278578 0.0155051 -0.0293825 0.1639478 0.0579079 0.0826939 0.0145758 0.0706335 -0.084308 -0.0311141 0.013422 -0.0309096 0.1495693 0.0215663 -0.1078892 -0.0045919 -0.0975263 -0.0591136 -0.0195809 -0.0044676 -0.0190867 0.1583671 -0.1314133 0.0151024 0.0156053 -0.0520979 0.0781403 -0.0029799 0.0079879 -0.0064402 0.126718 0.070975 -0.0435229 0.0694412 0.1362703 -0.0710025 0.0722934 0.0152052 0.0976467 -0.0541691 0.0612417 -0.0357561 -0.0920621 0.1302661 -0.0332617 -0.0841632 -0.0008437 -0.0900949 -0.0834996 unknown
polarizability: 203.6822663|0.0191192|187.1966235|-8.2016249|13.7096305|58.8025629 unknown
InChI: InChI=1S/C11H9NO3/c1-15-11-7-6-10(12(13)14)8-4-2-3-5-9(8)11/h2-7H,1H3
charge 0 multiplicity 1
24 atoms
O  -2.9701 0.692788 0.350493
O  3.273726 1.812687 0.055241
O  3.413318 -0.448766 -0.071286
N  2.717058 0.640541 0.01982
C  0.491343 -0.673044 0.001603
C  -0.955989 -0.57461 0.091852
C  1.243092 0.566103 0.092806
C  -1.583214 0.715595 0.27093
C  1.05477 -1.982036 -0.178171
C  -1.765662 -1.750475 0.002773
C  0.593826 1.798207 0.263189
C  -0.812871 1.886551 0.355337
C  0.236173 -3.11388 -0.262321
C  -1.181578 -3.006103 -0.17175
C  -3.67828 1.968127 0.527227
H  2.137147 -2.080148 -0.245303
H  -2.850546 -1.638325 0.073049
H  1.210443 2.69832 0.324182
H  -1.27581 2.866054 0.495718
H  0.698792 -4.09734 -0.399675
H  -1.807386 -3.902079 -0.239736
H  -4.743603 1.69969 0.553655
H  -3.482303 2.650635 -0.320793
H  -3.387745 2.452308 1.47816
