program: Gaussian 09
title: 000078922
version: EM64L-G09RevD.01
frameworkgroup: C1[X(C27H20N2O4S)]
method: RPBEPBE
basis: SDD
operation: Freq
keyword: #p
keyword: freq=noraman
keyword: PBEPBE/SDD
title: #p freq=noraman PBEPBE/SDD
converged: YES YES NO NO
title: Mulliken charges:
elementType: S O O O O N N C C C C C C C C C C C C C C C C C C C C C C C C C C C H H H H H H H H H H H H H H H H H H H H
charge: 0.851907 -0.537830 -0.520303 -0.300233 -0.315029 -0.488872 -0.675648 0.215361 0.072520 -0.353641 0.310505 0.300678 -0.437752 -0.175471 -0.133609 0.279815 0.292897 -0.015503 -0.386044 -0.387124 0.432552 -0.229805 -0.229205 -0.266233 -0.236839 -0.425228 -0.370907 -0.205014 -0.210404 0.441918 -0.360464 -0.385681 -0.215417 -0.806753 0.338138 0.380399 0.293873 0.292758 0.357732 0.383853 0.237668 0.237432 0.288378 0.268887 0.249527 0.258494 0.243164 0.244699 0.233594 0.230364 0.240314 0.237037 0.227394 0.227152
chargesum: 0.00000
title: Mulliken charges with hydrogens summed into heavy atoms:
elementType: S O O O O N N C C C C C C C C C C C C C C C C C C C C C C C C C C C
charge: 0.851907 -0.537830 -0.520303 -0.300233 -0.315029 -0.108473 0.065936 0.215361 0.072520 -0.353641 0.310505 0.300678 -0.099613 -0.175471 -0.133609 0.279815 0.292897 -0.015503 -0.092172 -0.094366 0.432552 0.007863 0.008227 0.022145 0.032048 -0.175701 -0.112413 0.038150 0.034296 0.441918 -0.126871 -0.155317 0.024896 -0.115170
polarizability: 6.20428720e+02 -5.77003198e+01 4.39985291e+02 9.23318152e+00 -3.48612012e+00 2.11614661e+02
1716.lowfreq: -54.0674 -0.0016 -0.0016 -0.0005 0.5385 4.2439 5.8286 17.9681 21.9790
frequency: -54.0471 17.6697 21.3066 22.9027 29.6994 32.6484 48.6200 62.0031 86.8595 111.5120 118.2323 131.0360 149.0690 153.0604 156.4994 177.9561 191.1435 205.9379 224.5192 228.5356 244.0983 247.2348 277.0178 290.8448 328.2439 350.4549 355.8068 367.5281 374.9150 394.3943 398.9886 402.6097 408.5753 414.6335 425.2358 428.0653 450.7806 462.9009 476.2662 485.9312 506.7435 515.7609 521.2375 528.5039 577.9017 603.2713 624.1919 633.8279 648.6542 655.2767 658.9936 674.7367 689.1385 701.7975 709.7219 732.0817 748.9087 756.9154 763.0236 764.8773 777.2759 784.4180 807.0417 814.0996 829.6921 837.9673 846.3692 855.6928 866.1432 874.1803 889.8387 910.0135 918.9923 926.9253 933.3538 934.3420 957.7310 971.0369 975.3147 978.3230 984.3275 987.4002 996.5388 1006.4608 1007.4588 1008.1992 1013.2985 1022.8616 1046.3360 1049.8603 1054.3523 1078.9305 1088.5664 1126.8061 1139.6108 1168.6694 1174.0093 1179.4969 1180.4019 1191.7491 1225.0111 1239.7495 1245.1712 1275.1481 1287.6126 1304.3752 1309.7000 1321.6756 1347.3153 1362.1632 1374.8760 1379.9043 1384.2262 1397.9428 1405.2974 1416.6002 1424.8040 1437.5643 1451.7808 1454.0326 1457.5136 1469.9035 1472.4289 1476.5250 1507.1289 1511.0036 1522.7001 1563.9325 1571.1071 1577.1308 1587.2939 1605.1076 1607.0908 1609.4862 1621.0228 1636.7707 2972.4911 2974.5200 3055.7618 3085.8536 3122.9350 3125.4590 3135.0929 3138.9017 3145.0238 3148.3176 3149.4069 3152.3639 3155.5660 3157.3272 3166.3936 3166.7134 3173.6630 3176.8543 3222.9879 3411.9185
redmass: 1.0095 4.2418 4.5974 6.1278 5.4966 4.7717 7.0010 4.8137 5.5351 6.2414 8.1872 5.3949 6.2692 6.4784 5.9308 6.3220 6.6817 9.1564 6.2287 9.3192 7.1105 6.8554 5.3053 5.1025 3.6134 7.9171 4.9976 8.1016 5.3161 6.1570 7.1191 2.8253 3.1017 6.9031 6.9262 3.8085 8.4236 8.1006 6.3902 4.6795 2.9062 5.6558 4.9351 6.2471 5.8087 6.4528 5.5850 6.5295 6.6652 6.6054 6.6336 4.4457 2.2521 5.8410 3.4376 2.4437 1.4900 3.9575 1.7102 2.9412 5.4113 6.2292 1.8940 1.9957 1.8663 1.5800 1.2220 1.1786 2.7547 7.4605 4.2468 7.8951 1.4975 1.3897 1.4107 1.8978 1.3301 1.3720 4.8259 4.6172 1.4780 1.4369 1.3884 1.3592 2.8513 4.1279 1.3625 2.6625 1.5518 2.0836 2.2584 1.5482 2.4290 1.3007 2.2502 1.1885 1.0680 1.1252 1.9116 1.1141 2.8147 2.7673 1.6386 2.4039 1.8540 1.3041 1.7583 2.5469 4.2580 4.4290 5.4258 7.7370 8.2303 1.2226 8.8204 3.4542 3.7040 2.2779 2.9665 2.0598 4.0631 1.2048 1.0547 2.7916 3.1043 6.1410 5.7549 2.4045 2.8614 5.7725 2.5652 6.9652 3.2559 4.0277 6.4242 5.7026 1.0806 1.0423 1.0945 1.0997 1.0884 1.0880 1.0864 1.0858 1.0919 1.0889 1.0955 1.0908 1.0955 1.0927 1.0943 1.0967 1.0994 1.1012 1.0525 1.1036
irintensity: 0.5353 0.5606 0.3215 0.7843 0.4836 0.2256 1.0259 0.6567 0.9189 2.5113 2.3771 1.3396 0.7150 0.3906 1.2056 0.8537 1.3837 4.8399 4.8530 1.4431 3.4587 3.9608 0.5251 1.0335 0.4286 1.1057 3.1497 5.6052 14.8424 25.4553 2.3091 0.5700 1.0545 20.1470 25.2537 2.0486 4.7121 50.2651 19.4227 38.0244 32.4275 13.2220 14.1964 93.8022 12.3002 0.6374 6.9934 0.5883 3.7794 21.9664 4.8088 2.2444 51.5931 0.7647 4.4604 54.7193 116.4005 0.9433 52.6936 38.9194 46.0866 30.4745 49.2066 30.7966 7.6527 8.4176 24.1727 115.4552 3.2678 23.7581 37.3529 75.7570 70.7305 1.4036 2.5936 3.5205 7.0006 3.2065 7.1299 9.9983 0.4023 0.6892 5.1764 0.2773 8.8623 1.5551 0.0688 36.4907 23.7437 20.4677 13.5711 6.8802 6.2587 13.0182 30.4283 14.6784 1.5467 8.4565 4.7022 1.6057 5.6726 7.8930 17.2132 45.5898 67.8138 2.8273 259.7007 440.6905 142.2602 10.8944 3.7495 8.7655 4.7240 7.6528 33.6780 2.5105 97.3940 14.4132 12.5032 15.1545 20.5520 10.2233 11.6774 13.5484 206.0358 100.5245 481.9388 18.0288 71.9896 4.2161 68.4558 0.9098 77.5944 36.5447 5.2963 67.4270 42.2331 44.6574 22.0565 16.2770 12.5346 32.8123 4.0626 1.3328 15.8613 4.4567 20.8128 17.0526 3.3013 1.6235 1.3877 7.5671 37.3682 23.9561 70.7632 306.4487
temp: 298.150 k
press: 1.00000 atm
elementType: 16 8 8 8 8 7 7 6 6 6 6 6 6 6 6 6 6 6 6 6 6 6 6 6 6 6 6 6 6 6 6 6 6 6 1 1 1 1 1 1 1 1 1 1 1 1 1 1 1 1 1 1 1 1
symmnumber: 1
zpe: 1056554.0 jmol-1
zpe.correction: 0.402420 hartree
zpe.thermalcorrener: 0.430397 hartree
zpe.thermalcorrenthalpy: 0.431341 hartree
zpe.thermalcorrgfe: 0.341855 hartree
zpe.sumelectzpe: -1846.894458 hartree
zpe.sumelectthermal: -1846.866481 hartree
zpe.sumelectthermalent: -1846.865537 hartree
zpe.sumelectthermalfe: -1846.955023 hartree
dipole: -1.5629 1.2458 5.5534
dipole: 5.9021
quadrupole: -177.5500 -188.8028 -212.3909
quadrupole: -3.7133 -16.2757 -20.0946
quadrupole: 15.3646 4.1118 -19.4763 -3.7133 -16.2757 -20.0946
hfenergy: -1847.2968779 hartree
pointgroup: C01 [X(C27H20N2O4S1)]
dipole: 0.6226316 0.5093298 -2.1782739 debye
polarizability: 615.4698742|64.3990741|444.6742772|13.9600458|4.2074391|211.8845211 unknown
InChI: InChI=1S/C27H20N2O4S/c1-16-11-13-17(14-12-16)29-21-15-22(34(32,33)18-7-3-2-4-8-18)25(28)24-23(21)26(30)19-9-5-6-10-20(19)27(24)31/h2-15,29H,28H2,1H3
charge 0 multiplicity 1
54 atoms
S  2.073402 -2.295432 1.477786
O  1.519813 -3.584773 2.339475
O  3.212747 -1.285968 2.072067
O  -3.432727 -2.660147 0.428447
O  -2.360507 2.717152 -0.326816
N  0.115493 2.371215 0.181472
N  -0.971591 -3.119592 1.088862
C  -1.777023 -0.884331 0.420517
C  -1.490609 0.515889 0.196229
C  0.574879 -1.21662 0.989605
C  -0.733631 -1.795055 0.834722
C  -0.151788 1.02869 0.380121
C  0.870221 0.118719 0.811682
C  -3.140677 -1.411214 0.238506
C  -2.569612 1.439761 -0.184403
C  -4.210412 -0.475576 -0.188218
C  -3.931878 0.905113 -0.396949
C  2.742587 -2.950143 -0.176993
C  -5.52733 -0.964861 -0.386768
C  -4.97374 1.780766 -0.800713
C  1.369462 3.033866 0.113212
C  -6.553716 -0.091262 -0.790193
C  -6.275591 1.286634 -0.998419
C  3.856735 -2.290093 -0.718647
C  2.139217 -4.079945 -0.750999
C  1.434056 4.375817 0.577379
C  2.532315 2.455328 -0.464182
C  4.382803 -2.787351 -1.933889
C  2.67822 -4.558306 -1.968439
C  3.8087 4.532669 -0.068267
C  2.633602 5.107016 0.484054
C  3.728742 3.197122 -0.539641
C  3.791244 -3.912098 -2.556581
C  5.093747 5.332655 -0.182869
H  1.879129 0.476035 1.042464
H  -0.768506 2.914969 -0.004872
H  -5.710779 -2.029746 -0.215888
H  -4.730775 2.837068 -0.948773
H  -0.258812 -3.660359 1.599805
H  -1.954394 -3.421762 0.955238
H  -7.569103 -0.472591 -0.942831
H  -7.077114 1.964026 -1.312034
H  4.305081 -1.441965 -0.189984
H  1.293736 -4.579018 -0.268067
H  0.542443 4.829923 1.024086
H  2.493486 1.448678 -0.892628
H  5.254416 -2.302764 -2.385818
H  2.232629 -5.435162 -2.449063
H  2.661805 6.138257 0.855883
H  4.615235 2.732755 -0.988442
H  4.204899 -4.292139 -3.496876
H  5.135907 5.886013 -1.141544
H  5.180061 6.077326 0.627943
H  5.983404 4.68011 -0.141549
