program: Gaussian 09
title: 000078614
version: EM64L-G09RevD.01
frameworkgroup: C1[X(C11H9NO3)]
method: RPBEPBE
basis: SDD
operation: Freq
keyword: #p
keyword: freq=noraman
keyword: PBEPBE/SDD
title: #p freq=noraman PBEPBE/SDD
converged: YES YES NO NO
title: Mulliken charges:
elementType: O O O N C C C C C C C C C C C H H H H H H H H H
charge: -0.277850 -0.196501 -0.189644 0.018086 0.253151 0.441122 0.103859 0.227703 -0.448347 -0.357262 -0.354988 -0.425887 -0.243131 -0.236536 -0.514973 0.244947 0.275902 0.253149 0.246919 0.236358 0.235147 0.241006 0.255580 0.212189
chargesum: 0.00000
title: Mulliken charges with hydrogens summed into heavy atoms:
elementType: O O O N C C C C C C C C C C C
charge: -0.277850 -0.196501 -0.189644 0.018086 0.253151 0.441122 0.103859 0.227703 -0.203400 -0.081360 -0.101839 -0.178969 -0.006772 -0.001389 0.193802
polarizability: 2.10071361e+02 8.72953274e+00 1.54140319e+02 1.05927261e-01 2.33345292e-01 6.65116174e+01
1716.lowfreq: -6.1323 -0.0005 0.0001 0.0003 3.5362 9.0389 58.0183 75.0042 93.4954
frequency: 58.0083 75.0006 93.4914 104.5201 147.6965 186.5903 190.6463 205.2699 275.0214 312.7518 354.4168 389.4381 413.3131 431.1053 489.8671 522.5577 538.8860 590.3241 625.7749 654.6881 695.5576 711.2750 741.7451 763.6967 788.5024 830.1165 838.2791 881.3598 885.4980 957.0147 975.4847 980.5622 996.5517 1022.8933 1041.7524 1106.5080 1141.9834 1148.4618 1158.1946 1181.1467 1217.6581 1228.6957 1239.2580 1279.4035 1330.7805 1369.2326 1405.3090 1408.1701 1428.1075 1430.8059 1454.8739 1463.7901 1475.7210 1508.9337 1571.4348 1598.2329 1631.6919 2973.8667 3076.7447 3128.5768 3134.1023 3135.3835 3143.2153 3162.6833 3164.7457 3180.3143
redmass: 3.7874 7.4423 3.9165 4.4881 1.0820 5.6328 6.3772 4.1011 7.9162 5.4766 6.9780 4.8272 5.8797 4.0931 4.0365 6.7840 3.4553 5.2131 5.6136 5.3797 6.8784 4.3750 8.8343 1.3230 3.8487 1.5353 5.1713 1.6488 5.9795 1.3454 1.5982 4.9615 1.3483 4.0890 2.4856 1.2559 1.8018 1.3384 1.2632 1.1328 4.5741 2.7413 2.3972 1.9316 3.1817 5.1609 5.2613 3.8838 1.6982 1.9579 1.0586 2.1808 1.0547 3.5247 8.1419 5.9862 6.7750 1.0321 1.1026 1.0872 1.1021 1.0885 1.0903 1.0966 1.0967 1.0971
irintensity: 6.2612 0.9637 6.5645 0.8646 0.9963 4.1419 0.9216 3.2871 2.2518 1.2073 1.1324 0.7546 7.3340 5.9293 12.5772 0.4630 4.8885 12.7610 2.3649 9.3332 5.1918 7.0580 13.0953 49.6532 3.3897 54.8017 5.9219 3.3580 22.1614 0.2853 10.4531 28.4871 0.2600 61.2347 14.1207 1.4007 1.4469 2.2984 1.1098 11.3659 102.6013 176.5547 54.5573 40.8297 26.5355 109.7658 17.1959 13.9933 8.6013 2.6077 12.0531 24.3710 14.6623 57.7461 11.0374 36.4016 26.8634 63.1742 25.8269 1.0538 23.3074 3.7828 14.2024 22.4247 8.9691 9.2421
temp: 298.150 k
press: 1.00000 atm
elementType: 8 8 8 7 6 6 6 6 6 6 6 6 6 6 6 1 1 1 1 1 1 1 1 1
symmnumber: 1
zpe: 464436.3 jmol-1
zpe.correction: 0.176894 hartree
zpe.thermalcorrener: 0.189558 hartree
zpe.thermalcorrenthalpy: 0.190503 hartree
zpe.thermalcorrgfe: 0.137521 hartree
zpe.sumelectzpe: -703.833645 hartree
zpe.sumelectthermal: -703.820981 hartree
zpe.sumelectthermalent: -703.820037 hartree
zpe.sumelectthermalfe: -703.873018 hartree
dipole: 2.0794 -4.7498 1.5099
dipole: 5.4003
quadrupole: -72.2238 -83.4125 -91.9369
quadrupole: 8.7629 -2.0977 0.8025
quadrupole: 10.3006 -0.8881 -9.4125 8.7629 -2.0977 0.8025
hfenergy: -704.0105396 hartree
pointgroup: C01 [X(C11H9N1O3)]
dipole: 0.8600199 1.8443384 -0.6106952 debye
dipolederiv: -1.6229163 0.313212 -0.2035381 0.1715986 -0.3611163 0.0127467 -0.024213 -0.0260855 -0.3808622 -0.332182 0.007822 -0.1505152 -0.0470788 -0.7346288 0.2632446 -0.1761625 0.1352892 -0.4679731 -0.6096789 -0.1932969 -0.2900564 -0.2155021 -0.4759806 -0.0246815 -0.3109857 0.0194595 -0.498698 0.7040189 0.3444912 0.5013752 0.4602801 1.296247 -0.2645217 0.5168344 -0.1584237 0.7850447 0.2688332 0.0957318 -0.0202741 -0.2401834 -0.1130846 -0.0036031 0.0373746 0.1009482 0.0309146 -0.0341513 -0.0135765 0.0021831 0.0971474 -0.2170327 -0.0037052 0.0048327 0.0032456 0.0593214 -0.1978023 -0.0868785 -0.0687251 -0.0635374 -0.4086939 0.0272885 -0.0853913 0.0337928 -0.0385494 1.2727795 -0.2828115 0.0128327 0.2606185 0.360213 0.0493679 -0.2759104 -0.043418 0.0078249 0.2634652 0.0191593 -0.0161927 -0.0896519 0.1652325 0.0056667 -0.0336686 -0.0000083 -0.1378321 -0.2045374 0.0048019 -0.0098127 0.0825167 0.0795036 0.0046296 -0.0204085 -0.0291766 -0.1279774 -0.4306721 -0.0850342 -0.0260856 -0.3086917 -0.0175658 0.0146072 0.0482031 0.008174 -0.148824 0.0549786 -0.0101137 -0.0143768 0.105382 0.1103986 -0.0050073 -0.0071382 -0.0011875 -0.1682186 0.0086408 -0.0417694 -0.0074378 -0.0694243 0.1888042 0.0009389 -0.0037303 -0.0133145 -0.1403311 0.0865717 0.0912401 -0.0161236 0.0922634 -0.1361593 -0.0062319 -0.0051972 -0.0028178 -0.1536019 0.7040271 -0.1138254 0.1932145 -0.2377118 0.3378894 -0.0535489 0.395435 -0.085504 0.4127258 0.0404913 -0.0969933 0.0015543 -0.0412239 -0.0500897 -0.0049141 -0.003844 0.0031272 0.1509238 0.1072041 -0.0661474 0.0153299 -0.0162901 0.0122412 -0.0066933 0.0055662 0.0246215 0.1483982 0.0244408 0.0913935 0.0168846 0.066931 0.0005027 -0.0079735 0.0401064 0.0016609 0.155649 0.0558974 -0.0236364 0.0043931 -0.0947402 -0.0767594 0.0014692 -0.0004128 -0.0037192 0.1566619 0.0059369 0.093298 0.0084479 0.1051736 -0.0367229 -0.0056809 0.0071584 -0.0044369 0.1559884 -0.1267117 -0.0244263 0.0134926 -0.0233113 0.091619 0.000022 0.013998 0.0043746 0.1626633 -0.1486662 0.0221997 0.0313622 -0.0026803 0.1130725 0.0146555 0.0632199 0.0109566 0.0591491 0.0625038 0.0373778 0.026544 -0.0066464 0.0093161 -0.1175094 -0.1118287 -0.0426517 -0.0443129 0.0475289 -0.0822176 -0.004476 0.0147621 -0.137206 0.1094339 -0.0738378 0.0650938 0.0219157 unknown
polarizability: 209.6665806|-9.1317477|154.2474653|5.9170592|-2.5414979|66.8092522 unknown
InChI: InChI=1S/C11H9NO3/c1-15-10-7-6-8-4-2-3-5-9(8)11(10)12(13)14/h2-7H,1H3
charge 0 multiplicity 1
24 atoms
O  -2.805813 0.592234 0.332084
O  -0.855346 -2.651557 0.790171
O  -2.197653 -1.878098 -0.881871
N  -1.26121 -1.71939 -0.006819
C  0.833198 -0.300768 0.021499
C  1.407388 1.031917 -0.005487
C  -0.6041 -0.396861 0.058704
C  -1.429967 0.738891 0.123373
C  0.545799 2.177311 0.044843
C  1.71593 -1.430266 -0.031774
C  -0.837992 2.039471 0.117075
C  2.830356 1.18314 -0.079857
C  3.098596 -1.244839 -0.112412
C  3.665867 0.067021 -0.134117
C  -3.685114 0.963512 -0.798503
H  0.998068 3.175582 0.044275
H  1.304586 -2.441423 0.012164
H  -1.493523 2.911499 0.20576
H  3.250494 2.195474 -0.096224
H  3.758143 -2.118344 -0.150709
H  4.752376 0.189692 -0.191902
H  -4.707586 0.923133 -0.396097
H  -3.561989 0.225952 -1.610864
H  -3.461608 1.984816 -1.162712
