program: Gaussian 09
title: 000078599
version: EM64L-G09RevD.01
frameworkgroup: C1[X(C7H5ClN2)]
method: RPBEPBE
basis: SDD
operation: Freq
keyword: #p
keyword: freq=noraman
keyword: PBEPBE/SDD
title: #p freq=noraman PBEPBE/SDD
converged: NO NO NO YES
title: Mulliken charges:
elementType: Cl N N C C C C C C C H H H H H
charge: -0.065950 -0.418828 -0.066791 0.317334 0.005706 -0.331167 -0.284967 -0.063047 -0.215027 -0.226511 0.261628 0.314906 0.254629 0.255400 0.262685
chargesum: 0.00000
title: Mulliken charges with hydrogens summed into heavy atoms:
elementType: Cl N N C C C C C C C
charge: -0.065950 -0.103922 -0.066791 0.317334 0.005706 -0.069539 -0.030338 -0.063047 0.040373 0.036173
polarizability: 1.47969976e+02 4.59312175e+00 9.54817832e+01 -4.08277099e-03 2.72999696e-03 3.74872599e+01
1716.lowfreq: -0.0027 -0.0022 0.0008 7.0602 13.5496 21.6837 118.4128 225.1488 236.9196
frequency: 118.4086 225.1468 236.9188 314.1699 349.6988 420.2916 429.8576 576.1099 592.5271 599.1472 628.8669 676.3438 759.0006 778.7333 814.2752 832.0579 852.6113 878.2132 910.6899 954.4744 1047.1525 1074.9425 1107.8836 1171.1159 1232.7792 1253.9874 1280.0595 1334.7319 1385.3019 1435.4004 1458.6201 1468.8814 1583.5348 1629.2791 3160.9691 3168.5505 3180.9413 3229.7865 3597.2570
redmass: 8.3750 8.4233 4.2305 6.5780 16.6201 2.8440 4.4831 6.9410 2.4633 2.1946 1.9201 7.8586 3.3136 5.2531 1.4501 1.4879 1.5238 6.6080 6.1444 1.3384 2.0389 1.9005 1.8720 1.6850 1.5358 4.0360 1.9829 1.8806 3.9561 3.6311 6.4700 2.8649 7.8570 7.7451 1.0884 1.0938 1.0978 1.0986 1.0819
irintensity: 0.2348 2.0887 15.2508 0.0579 1.6766 17.4927 14.3824 9.6272 7.1033 92.6555 23.7329 13.3395 2.6741 3.9189 3.7739 80.3456 23.4473 32.4660 3.2142 0.8940 19.2585 23.5897 4.8078 12.3101 17.1102 12.9765 15.9345 67.3579 6.8983 49.7271 0.3889 17.4576 14.3893 30.5682 0.8570 1.1657 4.1698 1.0344 54.2540
temp: 298.150 k
press: 1.00000 atm
elementType: 17 7 7 6 6 6 6 6 6 6 1 1 1 1 1
symmnumber: 1
zpe: 279619.4 jmol-1
zpe.correction: 0.106501 hartree
zpe.thermalcorrener: 0.113885 hartree
zpe.thermalcorrenthalpy: 0.114829 hartree
zpe.thermalcorrgfe: 0.073974 hartree
zpe.sumelectzpe: -838.620689 hartree
zpe.sumelectthermal: -838.613305 hartree
zpe.sumelectthermalent: -838.612361 hartree
zpe.sumelectthermalfe: -838.653216 hartree
dipole: -1.5826 -3.2054 0.0000
dipole: 3.5748
quadrupole: -66.6366 -53.7281 -68.0084
quadrupole: 12.7994 0.0008 0.0002
quadrupole: -3.8456 9.0629 -5.2174 12.7994 0.0008 0.0002
hfenergy: -838.7271899 hartree
pointgroup: C01 [X(C7H5Cl1N2)]
dipole: 0.679293 1.2315158 -0.0000129 debye
dipolederiv: -0.8180171 0.1358553 -0.0000517 0.2118248 -0.1771313 0.0000192 -0.0000621 0.0000144 -0.0759827 -0.500359 0.105005 -0.000019 -0.1732522 -0.547508 0.0000016 -0.0000064 -0.0000196 -0.2746104 -0.3841037 -0.1597788 0.0000012 -0.018536 -0.5040068 -0.0000028 -0.0000005 0.0000194 -0.259132 0.2857849 0.2116342 0.00002 0.4105539 0.1057499 0.0000197 0.0000007 0.00001 0.0687478 0.2993241 0.1102942 0.0000114 -0.1602853 -0.1087816 -0.0000009 0.000009 0.0000073 -0.006977 -0.236763 -0.0485182 -0.0000143 0.0277308 -0.0657894 -0.0000081 -0.0000164 -0.000008 -0.1468842 0.1737227 -0.0350969 0.0000075 0.0642827 0.131383 -0.0000123 0.000005 -0.0000244 -0.1201988 1.1021932 -0.2137014 0.0000948 -0.4044439 0.3003111 -0.0000385 0.0001198 -0.000035 -0.0675307 -0.3638298 0.1270915 -0.0000296 0.2132408 -0.0868794 -0.0000003 -0.0000511 -0.0000022 -0.1445472 0.09957 -0.2189822 -0.0000125 -0.1576593 0.7152447 -0.0000256 0.0000275 -0.0000219 -0.0574552 0.0733832 0.0234663 -0.000007 0.0346407 -0.0264227 0.0000134 -0.0000104 0.000019 0.1921872 0.185546 0.0410772 -0.000003 0.0483576 0.1834163 0.0000074 0. 0.0000102 0.3662763 0.0748601 0.0479136 -0.000005 0.0209088 -0.0408964 0.0000137 0.0000025 0.0000216 0.1662283 0.0089203 -0.0803548 0.0000039 -0.0650143 0.0398144 0.0000081 0.0000033 0.0000091 0.1728015 -0.0002318 -0.0459052 0.0000035 -0.0523491 0.0814964 0.0000054 -0.000021 0.0000002 0.1870771 unknown
polarizability: 148.2785133|2.1924892|95.173246|0.0039546|-0.0029126|37.4872599 unknown
InChI: InChI=1S/C7H5ClN2/c8-5-1-2-6-7(3-5)10-4-9-6/h1-4,10H
charge 0 multiplicity 1
15 atoms
Cl -3.587694 0.647927 -0.000237
N  1.712817 1.378915 0.000016
N  2.239208 -0.847675 0.00012
C  0.482519 0.704633 -0.000012
C  0.831004 -0.692196 0.000044
C  -0.853226 1.157883 -0.000087
C  -0.189457 -1.670634 0.000056
C  -1.831047 0.148057 -0.000083
C  -1.531176 -1.241151 0.000015
C  2.720763 0.402562 0.000022
H  -1.130004 2.215511 -0.000161
H  1.853346 2.387739 -0.000001
H  0.06202 -2.735103 0.000132
H  -2.34929 -1.966797 0.000062
H  3.778017 0.662329 0.000012
