program: Gaussian 09
title: 000078653
version: EM64L-G09RevD.01
frameworkgroup: C1[X(C15H26O2)]
method: RPBEPBE
basis: SDD
operation: Freq
keyword: #pfreq=noraman
keyword: PBEPBE/SDD
title: #p freq=noraman PBEPBE/SDD
converged: YES YES NO NO
title: Mulliken charges:
elementType: O O C C C C C C C C C C C C C C C H H H H H H H H H H H H H H H H H H H H H H H H H H
charge: -0.267067 -0.242616 -0.397142 -0.380615 -0.377737 -0.415134 -0.405645 -0.375696 -0.389155 -0.393027 -0.454023 -0.492694 -0.142225 0.249080 -0.485462 -0.167890 -0.242171 0.216120 0.199210 0.194850 0.192060 0.194372 0.191642 0.200016 0.200269 0.196880 0.192700 0.196586 0.196074 0.211778 0.193767 0.238020 0.212583 0.198774 0.217219 0.234922 0.218449 0.199441 0.222508 0.202760 0.204306 0.231139 0.222774
chargesum: 0.00000
title: Mulliken charges with hydrogens summed into heavy atoms:
elementType: O O C C C C C C C C C C C C C C C
charge: -0.267067 -0.242616 0.018188 0.006295 0.008277 -0.014849 -0.016065 0.016963 0.016391 0.057576 -0.038030 -0.039323 0.057216 0.249080 -0.060194 0.036416 0.211742
polarizability: 1.91788741e+02 4.38287440e+00 1.72833288e+02 -4.42312257e+00 -1.38137394e+00 1.30951889e+02
1716.lowfreq: -12.7284 -5.4151 -0.0007 -0.0007 -0.0007 8.3476 25.9175 38.1316 55.9547
frequency: 25.7357 37.8596 55.9476 57.2957 73.3133 87.8818 122.6856 133.8523 153.5404 156.3089 181.6687 216.7140 226.5503 236.3645 259.4747 266.0044 282.9965 290.7621 347.6682 360.4864 382.8601 420.8786 465.0641 503.7658 507.6780 584.3660 616.4415 670.0564 699.4816 710.9389 723.7899 748.6892 770.9245 790.2650 812.1478 835.5292 854.2669 876.6933 884.6085 895.4381 924.9787 960.8485 971.0887 982.0268 991.4297 995.6842 1015.7857 1025.9882 1038.9245 1057.4596 1061.5732 1076.7896 1092.0989 1107.9083 1113.2835 1115.9577 1129.8401 1144.3012 1162.2587 1193.0803 1201.9999 1226.9088 1228.3695 1235.2385 1250.6382 1264.3318 1269.7255 1276.4031 1279.4658 1284.6623 1288.3638 1295.7630 1306.7676 1319.3878 1323.5130 1340.2851 1343.0491 1349.5896 1351.6092 1356.4888 1360.2008 1363.7691 1397.5003 1447.9598 1449.1224 1457.3073 1459.8938 1461.3184 1467.4893 1468.4070 1472.6028 1475.9964 1478.7209 1481.7174 1493.6442 1637.8512 1680.9379 2946.5432 2955.1324 2958.2201 2960.2385 2962.3294 2968.1620 2970.2939 2972.4736 2975.4228 2984.2148 2996.1883 3001.3590 3002.2374 3003.9475 3009.7923 3014.5264 3026.3719 3026.9605 3042.5556 3046.7030 3052.1278 3059.1031 3060.4400 3071.0562 3088.0216 3093.9436
redmass: 6.2335 4.3751 4.1974 2.9860 3.0627 2.4445 2.1858 2.7940 2.2707 3.2874 3.1806 2.1303 2.2803 2.2969 2.9230 2.9515 3.0277 2.4819 3.0638 3.0344 2.4007 3.0063 2.2118 2.5550 2.1304 3.5326 3.7199 2.8424 1.2930 1.1571 1.3004 1.3429 1.6875 2.1074 1.5366 2.0831 2.0226 2.4050 1.8901 1.8221 3.6479 1.9620 2.0850 1.5625 1.8018 2.2299 1.9581 2.1947 2.3073 2.1474 2.5587 1.7640 2.0060 2.2165 2.6397 1.7678 1.6457 1.4422 1.5341 1.3030 2.1216 1.3532 1.1791 1.3664 1.3497 1.2672 1.2801 1.1904 1.1715 1.1702 1.1396 1.1287 1.1439 1.3541 1.2913 1.4321 1.4209 1.3778 1.4011 1.4157 1.4557 1.5218 1.4971 1.0836 1.0966 1.0821 1.0831 1.0766 1.0746 1.0822 1.0812 1.0842 1.0891 1.0902 1.0950 10.3954 7.3462 1.0666 1.0595 1.0587 1.0612 1.0619 1.0645 1.0659 1.0634 1.0624 1.0657 1.0641 1.0935 1.0581 1.0987 1.0966 1.0983 1.0939 1.0999 1.0988 1.0979 1.0942 1.0882 1.0967 1.1040 1.0999 1.0964
irintensity: 1.1750 0.1944 0.3754 0.0407 0.0791 0.3829 0.2294 0.4988 0.5273 2.2806 3.7955 0.0757 0.9884 1.5355 1.5112 0.7193 2.7559 0.3198 3.0769 0.7716 0.6427 2.1355 0.2124 2.3850 5.1118 4.5013 11.3595 7.8974 53.0540 16.0197 6.8107 2.3783 0.8347 7.1976 7.6508 10.9890 5.1971 0.5889 2.9797 0.7632 49.2425 4.7863 15.7685 0.6727 10.8268 5.4474 9.1960 2.5629 3.6982 13.8056 46.7950 11.6625 31.0058 2.3951 9.4797 19.2481 6.3807 2.4616 27.2576 16.6341 157.0277 9.2741 2.4969 8.6725 8.3399 13.3771 4.3424 13.8145 0.9457 2.7448 10.0705 1.0872 1.4694 1.0762 0.6821 0.4434 0.7658 2.2068 2.1867 1.5067 4.3620 2.9060 2.7922 7.3596 5.7506 10.4027 9.0155 7.5731 0.6606 2.6231 10.4190 2.9014 8.7482 35.1856 4.2447 254.5766 2.8738 21.1559 25.2751 17.6506 14.9728 10.6462 66.4468 24.6136 72.3317 21.4356 9.6964 35.3988 13.9836 37.1262 0.8854 38.2125 29.4577 47.4659 59.5282 83.9779 124.0936 19.6915 37.0843 11.6914 19.9173 48.3100 78.5223
temp: 298.150 k
press: 1.00000 atm
elementType: 8 8 6 6 6 6 6 6 6 6 6 6 6 6 6 6 6 1 1 1 1 1 1 1 1 1 1 1 1 1 1 1 1 1 1 1 1 1 1 1 1 1 1
symmnumber: 1
zpe: 1002372.9 jmol-1
zpe.correction: 0.381784 hartree
zpe.thermalcorrener: 0.400525 hartree
zpe.thermalcorrenthalpy: 0.401469 hartree
zpe.thermalcorrgfe: 0.333876 hartree
zpe.sumelectzpe: -736.258710 hartree
zpe.sumelectthermal: -736.239969 hartree
zpe.sumelectthermalent: -736.239025 hartree
zpe.sumelectthermalfe: -736.306618 hartree
dipole: 2.1856 1.4004 0.1973
dipole: 2.6033
quadrupole: -113.1923 -106.6617 -103.2665
quadrupole: -10.3788 -1.5740 0.9399
quadrupole: -5.4855 1.0451 4.4403 -10.3788 -1.5740 0.9399
hfenergy: -736.6404939 hartree
pointgroup: C01 [X(C15H26O2)]
dipole: -0.9174337 -0.4483053 0.0796452 debye
polarizability: 192.5191939|2.151105|172.0968132|4.6528299|0.5233039|130.957911 unknown
InChI: InChI=1S/C15H26O2/c16-15-13-11-9-7-5-3-1-2-4-6-8-10-12-14-17-15/h8,10H,1-7,9,11-14H2
charge 0 multiplicity 1
43 atoms
O  2.10252 0.090859 0.037198
O  3.821031 1.665625 -0.01041
C  -2.802161 0.681227 -0.067784
C  -2.616647 1.879263 0.891938
C  -3.202761 -0.617708 0.669733
C  -2.156351 3.194164 0.208033
C  -3.270916 -1.870466 -0.241647
C  -0.877042 3.065499 -0.661002
C  -1.926563 -2.294128 -0.887416
C  0.319301 2.426943 0.078352
C  -0.842381 -2.732967 0.133469
C  1.556552 2.252021 -0.843764
C  0.429673 -3.194325 -0.5517
C  2.628078 1.359051 -0.240713
C  2.197086 -2.139252 1.005424
C  1.715879 -2.930642 -0.195608
C  3.0335 -0.903259 0.64189
H  -1.858001 0.508053 -0.618735
H  -3.568894 0.92672 -0.83229
H  -1.884447 1.594556 1.675227
H  -3.570289 2.070737 1.425627
H  -4.191634 -0.470062 1.15064
H  -2.486501 -0.796195 1.498029
H  -1.987837 3.95969 0.993143
H  -2.976686 3.579323 -0.431688
H  -4.008906 -1.68297 -1.048923
H  -3.664982 -2.723607 0.349226
H  -0.593155 4.070656 -1.0342
H  -1.102786 2.456771 -1.560586
H  -1.523503 -1.472441 -1.510785
H  -2.118377 -3.138633 -1.581153
H  0.031249 1.43082 0.456949
H  0.59423 3.041629 0.958667
H  -1.260477 -3.561638 0.74623
H  -0.623409 -1.905451 0.832014
H  2.019747 3.224197 -1.082562
H  1.223779 1.787807 -1.793231
H  0.270379 -3.814576 -1.449153
H  1.355886 -1.822379 1.646693
H  2.844156 -2.791055 1.629925
H  2.518071 -3.339363 -0.830556
H  3.506088 -0.446682 1.530849
H  3.827201 -1.134212 -0.092946
