program: Gaussian 09
title: 000078621
version: EM64L-G09RevD.01
frameworkgroup: C1[X(C16H16O2)]
method: RPBEPBE
basis: SDD
operation: Freq
keyword: #pfreq=noraman
keyword: PBEPBE/SDD
title: #p freq=noraman PBEPBE/SDD
converged: NO NO NO NO
title: Mulliken charges:
elementType: O O C C C C C C C C C C C C C C C C H H H H H H H H H H H H H H H H
charge: -0.195209 -0.195208 0.331608 0.331609 -0.510486 -0.510499 -0.510500 -0.510485 0.356233 0.356247 0.356247 0.356234 -0.130492 -0.130494 -0.788682 -0.788682 -0.788684 -0.788683 0.228500 0.228508 0.228509 0.228499 0.249900 0.211702 0.249875 0.249900 0.249877 0.211701 0.249881 0.249895 0.211703 0.211702 0.249893 0.249883
chargesum: 0.00000
title: Mulliken charges with hydrogens summed into heavy atoms:
elementType: O O C C C C C C C C C C C C C C C C
charge: -0.195209 -0.195208 0.331608 0.331609 -0.281986 -0.281991 -0.281991 -0.281986 0.356233 0.356247 0.356247 0.356234 -0.130492 -0.130494 -0.077205 -0.077205 -0.077205 -0.077205
polarizability: 4.89690974e+02 -2.47503051e-05 1.87257147e+02 3.50358073e-04 8.32134977e-04 8.80427818e+01
1716.lowfreq: -1.3601 0.0004 0.0008 0.0009 3.8330 11.7695 22.0916 45.9821 78.7986
frequency: 22.0916 45.9821 78.7902 98.9690 106.1149 107.1278 108.5437 109.9779 123.7085 184.3747 219.0882 227.4427 248.5055 259.6009 270.2208 298.8586 299.4377 319.2020 333.6621 335.7535 456.7419 466.4514 467.3863 481.6392 504.0134 505.0728 559.0900 585.4942 600.3661 658.2317 659.3955 758.1538 790.8377 798.6685 819.0492 854.8773 871.6139 900.9234 904.1271 920.2617 939.9846 947.9883 954.9120 1024.4449 1035.0652 1035.3687 1038.7426 1040.8975 1050.2765 1052.7518 1059.1798 1195.2865 1228.1058 1232.6003 1261.4442 1289.8258 1347.1268 1350.9610 1358.0965 1398.0372 1398.1662 1398.8504 1399.6830 1421.4732 1423.5248 1442.9451 1443.2037 1444.2339 1444.6423 1451.7720 1457.1685 1460.5086 1462.3047 1469.8599 1505.8784 1537.8785 1567.2791 1580.2661 1622.6353 1650.1415 2983.3006 2983.3358 2983.4032 2983.5439 3060.8998 3060.9142 3060.9914 3061.0678 3094.0100 3094.1272 3094.2069 3094.4787 3139.4339 3141.6980 3152.8690 3157.7382
redmass: 3.4319 7.5660 6.2435 1.6995 1.0382 1.0255 1.0424 4.1837 1.5451 3.4178 2.9072 3.4056 2.6898 3.3441 2.6190 4.5505 4.3693 4.6506 3.8535 6.5533 2.9231 3.1029 6.2929 4.5155 4.9604 6.0894 3.4279 4.6827 3.3580 5.8034 2.8422 4.2895 4.5993 3.6754 5.3313 1.4245 1.2956 1.9216 1.4078 3.9441 3.7172 3.4049 2.0496 1.8099 1.7145 1.7587 1.5166 1.5122 1.6519 1.6297 1.6381 2.4788 1.6888 4.8641 3.5028 2.4260 2.0958 1.7491 3.2109 1.2275 1.2775 1.2594 1.2761 2.1604 5.8151 1.0454 1.0456 1.0458 1.0458 1.3240 1.1386 1.1616 1.1513 3.1024 6.1303 4.7761 5.3572 5.8947 5.6299 6.6686 1.0365 1.0365 1.0365 1.0365 1.0956 1.0955 1.0956 1.0956 1.1010 1.1009 1.1010 1.1009 1.0918 1.0918 1.0869 1.0884
irintensity: 0.0000 5.1677 0.0000 12.4211 0.0000 0.0000 0.0000 1.4552 0.9986 0.0000 0.0000 0.0000 0.0000 0.0000 2.8507 0.0112 2.0451 18.1060 0.0001 0.0000 0.0000 0.0000 55.8550 1.9615 0.0000 0.0000 0.0054 2.1278 0.0000 0.3726 0.0001 0.0001 9.0268 0.0000 14.2279 0.0000 0.0000 0.0000 50.7993 0.0000 24.1969 0.0000 12.5786 0.0000 0.0001 3.0356 0.0000 0.0000 0.0001 33.8241 71.9439 0.0000 0.0001 183.3511 13.5078 3.9291 0.0000 6.6877 0.0000 58.5096 0.0019 116.8462 0.0001 10.8164 0.0000 0.0000 0.0000 0.0003 52.0972 0.0000 0.0000 0.7780 0.1407 0.0000 776.9288 0.0000 0.0000 78.3895 0.0000 10.1745 0.5364 44.8234 16.8045 0.0148 0.0133 0.0128 0.0193 38.5354 0.0831 0.6346 46.5961 0.0003 0.0004 7.0876 48.0588 0.0004
temp: 298.150 k
press: 1.00000 atm
elementType: 8 8 6 6 6 6 6 6 6 6 6 6 6 6 6 6 6 6 1 1 1 1 1 1 1 1 1 1 1 1 1 1 1 1
symmnumber: 1
zpe: 711355.6 jmol-1
zpe.correction: 0.270941 hartree
zpe.thermalcorrener: 0.289064 hartree
zpe.thermalcorrenthalpy: 0.290008 hartree
zpe.thermalcorrgfe: 0.224262 hartree
zpe.sumelectzpe: -768.456748 hartree
zpe.sumelectthermal: -768.438626 hartree
zpe.sumelectthermalent: -768.437681 hartree
zpe.sumelectthermalfe: -768.503427 hartree
dipole: 0.0000 -0.0001 -0.0012
dipole: 0.0013
quadrupole: -144.3764 -88.4323 -108.0163
quadrupole: -0.0001 -0.0020 0.0002
quadrupole: -30.7681 25.1761 5.5920 -0.0001 -0.0020 0.0002
hfenergy: -768.7276894 hartree
pointgroup: C01 [X(C16H16O2)]
dipole: 0.0000033 0.0000589 -0.0004886 debye
polarizability: 489.6909739|-0.0007943|187.2571467|-0.0003504|-0.0008321|88.0427818 unknown
InChI: InChI=1S/C16H16O2/c1-9-5-13(6-10(2)15(9)17)14-7-11(3)16(18)12(4)8-14/h5-8H,1-4H3
charge 0 multiplicity 1
34 atoms
O  -4.915522 -0.000044 0.000475
O  4.915523 -0.000063 0.000254
C  -0.715947 0.000033 -0.000301
C  0.715947 0.000026 -0.000285
C  -1.482157 -1.239547 -0.000197
C  -1.482203 1.239588 -0.000216
C  1.482207 1.239579 -0.000223
C  1.482153 -1.239556 -0.000204
C  -2.86266 -1.273106 -0.000224
C  -2.862707 1.273097 -0.00024
C  2.862711 1.273083 -0.000189
C  2.862656 -1.273121 -0.000161
C  -3.63342 -0.00002 -0.000701
C  3.633421 -0.000034 -0.000375
C  -3.654196 -2.557055 0.00003
C  -3.654289 2.557018 0.000004
C  3.654302 2.556997 -0.000055
C  3.654181 -2.557077 -0.000003
H  -0.949177 -2.195206 -0.00004
H  -0.949278 2.195276 -0.000061
H  0.949275 2.19526 -0.000179
H  0.949181 -2.19522 -0.000131
H  -4.321588 -2.602277 0.88062
H  -2.996514 -3.442907 0.000259
H  -4.321507 -2.602664 -0.880602
H  -4.321654 2.602241 0.880614
H  -4.321632 2.602582 -0.880606
H  -2.996636 3.442893 0.000191
H  4.321652 2.602478 -0.880667
H  4.321661 2.602289 0.880554
H  2.996662 3.442877 0.000043
H  2.996491 -3.442922 0.000069
H  4.321503 -2.602409 0.880633
H  4.321564 -2.602586 -0.880584
