program: Gaussian 09
title: 000078607
version: EM64L-G09RevD.01
frameworkgroup: C1[X(C10H20N2)]
method: RPBEPBE
basis: SDD
operation: Freq
keyword: #pfreq=noraman
keyword: PBEPBE/SDD
title: #p freq=noraman PBEPBE/SDD
converged: YES YES NO NO
title: Mulliken charges:
elementType: N N C C C C C C C C C C H H H H H H H H H H H H H H H H H H H H
charge: -0.096434 -0.268482 0.059676 -0.425157 -0.431113 -0.349769 -0.354360 -0.406149 -0.406071 -0.398379 -0.441529 -0.443937 0.160955 0.225596 0.190849 0.194814 0.224932 0.160935 0.210564 0.215789 0.160701 0.189338 0.203969 0.203515 0.189463 0.212012 0.187541 0.170469 0.213901 0.213986 0.170380 0.261995
chargesum: 0.00000
title: Mulliken charges with hydrogens summed into heavy atoms:
elementType: N N C C C C C C C C C C
charge: -0.096434 -0.006487 0.220631 -0.008712 -0.011367 0.021730 0.022130 -0.012843 -0.013092 0.001175 -0.057160 -0.059571
polarizability: 1.43510805e+02 -5.20670998e-02 1.16064663e+02 -6.02152575e-02 -3.08692675e-02 9.48731086e+01
1716.lowfreq: -24.6730 -0.0006 -0.0003 0.0008 8.2895 16.0701 20.2771 67.6711 137.5044
frequency: -21.3245 67.5171 137.4948 174.8424 219.2294 233.9124 271.8023 283.3008 338.1488 376.9228 380.0110 433.9669 435.7486 452.6334 474.7085 505.3986 586.9138 688.2297 771.2948 802.3523 811.3406 814.6130 856.3910 866.0273 896.4274 915.6500 922.5098 958.6505 978.9484 985.9466 1017.7865 1052.8373 1069.7935 1072.4470 1106.9405 1107.9104 1120.7433 1121.3858 1139.8093 1149.2469 1154.3971 1176.0325 1205.3412 1237.7623 1243.7201 1261.4713 1271.4249 1272.3122 1286.7585 1301.4500 1303.2530 1323.6748 1329.1389 1336.8792 1343.4644 1345.0517 1365.0410 1366.5924 1388.2297 1396.3172 1442.2807 1450.3933 1451.0002 1459.6209 1461.0202 1465.2650 1466.9916 1467.3283 1475.8417 1478.0244 2784.0047 2804.1035 2819.1898 2828.9798 2837.8317 2966.0424 2982.9990 2983.4074 2997.5450 3001.2791 3030.1000 3031.2204 3034.3601 3041.3439 3050.9144 3058.4662 3063.3108 3069.7178 3072.9259 3448.1486
redmass: 2.6984 3.1388 2.6327 3.4148 1.8023 1.8170 2.6592 3.2398 1.7930 2.8216 1.9971 2.5783 2.9512 2.9937 2.2940 1.5312 1.8905 1.8421 2.9944 1.4765 1.4761 2.6563 1.4148 2.8260 2.5632 2.2756 1.8373 1.3014 2.5204 1.7153 2.2505 2.0671 1.6113 1.9494 2.1861 2.0094 2.3682 2.6138 1.4606 2.3680 1.3165 2.2832 1.2096 1.8166 1.2996 1.2803 1.1811 1.2569 1.1714 1.2854 1.2279 1.2942 1.3783 1.4263 1.5516 1.4843 1.4178 1.4412 1.4145 1.3709 1.2621 1.1021 1.1284 1.0853 1.0910 1.0792 1.0855 1.0826 1.1029 1.0998 1.0794 1.0718 1.0702 1.0723 1.0699 1.0620 1.0599 1.0622 1.0596 1.0606 1.0864 1.0966 1.0877 1.1027 1.1025 1.0934 1.0943 1.0937 1.0961 1.0751
irintensity: 0.0363 0.6018 0.0237 0.1871 1.2295 0.4765 2.9754 0.8254 2.7925 0.4036 1.0698 19.7461 3.5190 0.4667 0.8792 43.1550 27.2375 86.7852 2.4336 0.0196 0.4382 1.2585 2.8757 9.3190 9.1361 1.9379 0.1004 4.1031 16.1747 1.7141 14.4525 2.0245 10.1450 3.0979 8.9323 2.7832 2.3574 29.8418 16.7240 20.4933 0.6135 4.1255 10.5600 5.4338 6.0927 2.6794 8.4999 4.4535 3.7900 8.8856 3.7540 22.8832 7.3952 1.9579 18.9500 1.1874 12.8278 16.1512 2.2203 0.9878 6.2244 4.3177 2.7724 3.4885 13.1399 0.3709 12.4870 7.8794 12.2002 1.7040 30.6361 42.7976 147.5489 56.9498 261.6847 38.8130 51.6578 31.4429 16.3590 24.7853 78.8298 69.9975 29.5203 35.1305 67.3425 9.6692 81.6576 72.3393 11.3536 3.7106
temp: 298.150 k
press: 1.00000 atm
elementType: 7 7 6 6 6 6 6 6 6 6 6 6 1 1 1 1 1 1 1 1 1 1 1 1 1 1 1 1 1 1 1 1
symmnumber: 1
zpe: 765800.2 jmol-1
zpe.correction: 0.291678 hartree
zpe.thermalcorrener: 0.302382 hartree
zpe.thermalcorrenthalpy: 0.303326 hartree
zpe.thermalcorrgfe: 0.255925 hartree
zpe.sumelectzpe: -501.554518 hartree
zpe.sumelectthermal: -501.543814 hartree
zpe.sumelectthermalent: -501.542870 hartree
zpe.sumelectthermalfe: -501.590271 hartree
dipole: -0.3565 -0.0097 1.6063
dipole: 1.6454
quadrupole: -69.9991 -72.6572 -78.8213
quadrupole: -0.0704 -2.7943 -0.0238
quadrupole: 3.8268 1.1686 -4.9954 -0.0704 -2.7943 -0.0238
hfenergy: -501.8461959 hartree
pointgroup: C01 [X(C10H20N2)]
dipole: 0.1367825 0.0034773 0.6327348 debye
polarizability: 143.5085321|-0.0787858|116.0647652|0.3287037|0.0377229|94.8752795 unknown
InChI: InChI=1S/C10H20N2/c1-2-8-12(9-3-1)10-4-6-11-7-5-10/h10-11H,1-9H2
charge 0 multiplicity 1
32 atoms
N  -0.726664 -0.005642 -0.149615
N  3.591619 0.00557 -0.317834
C  0.704587 -0.009109 0.310866
C  1.464797 -1.255696 -0.218498
C  1.463311 1.262193 -0.155918
C  -1.46993 -1.210908 0.315521
C  -1.460021 1.226377 0.256248
C  -2.90726 -1.258049 -0.243402
C  -2.898283 1.253661 -0.302752
C  -3.694647 0.010481 0.145084
C  2.955055 -1.229935 0.181704
C  2.954304 1.214788 0.241143
H  0.742602 -0.034666 1.436849
H  1.380139 -1.272399 -1.32124
H  1.025866 -2.190143 0.175354
H  1.026557 2.174388 0.289347
H  1.378226 1.338542 -1.256406
H  -1.513561 -1.240829 1.438868
H  -0.933956 -2.114975 -0.01584
H  -0.920691 2.108481 -0.124772
H  -1.501296 1.315683 1.376568
H  -3.412068 -2.168233 0.134777
H  -2.856061 -1.337044 -1.346829
H  -2.847171 1.279053 -1.408779
H  -3.397128 2.18432 0.030922
H  -4.702466 0.003648 -0.311741
H  -3.836092 0.036719 1.245771
H  3.026051 -1.32561 1.297506
H  3.470195 -2.103168 -0.259354
H  3.469315 2.108709 -0.156527
H  3.025153 1.255759 1.360311
H  4.612117 0.003035 -0.192433
