program: Gaussian 09
title: 000078598
version: EM64L-G09RevD.01
frameworkgroup: C1[X(C8H8N2O)]
method: RPBEPBE
basis: SDD
operation: Freq
keyword: #pfreq=noraman
keyword: PBEPBE/SDD
title: #p freq=noraman PBEPBE/SDD
converged: NO NO NO NO
title: Mulliken charges:
elementType: O N N C C C C C C C C H H H H H H H H
charge: -0.264470 -0.421832 -0.064477 0.321925 -0.023501 -0.481300 0.352914 -0.277141 -0.353976 -0.242862 -0.537256 0.245087 0.249078 0.305577 0.250671 0.258722 0.218020 0.246803 0.218019
chargesum: 0.00000
title: Mulliken charges with hydrogens summed into heavy atoms:
elementType: O N N C C C C C C C C
charge: -0.264470 -0.116255 -0.064477 0.321925 -0.023501 -0.236214 0.352914 -0.028063 -0.103306 0.015860 0.145586
polarizability: 1.52179320e+02 5.55436632e+00 1.05858676e+02 -7.18455592e-04 7.20548381e-05 4.67801962e+01
1716.lowfreq: -5.3224 -0.0006 -0.0002 0.0007 10.6075 14.2392 86.7037 151.6642 201.6177
frequency: 86.6081 151.6586 201.6125 238.8378 239.0015 352.8050 363.0502 431.9932 447.3511 505.5306 586.4284 597.1315 623.6738 632.6161 733.6399 760.9430 794.2395 798.8935 825.5581 829.4094 904.0831 925.3197 958.8107 996.7135 1068.3636 1100.6799 1114.9133 1147.1563 1164.3576 1180.1923 1250.2841 1270.4406 1293.9196 1335.5237 1390.4862 1434.5543 1441.3226 1466.0227 1470.2076 1478.6379 1495.2593 1586.9431 1640.7019 2948.7298 3031.6358 3119.8686 3156.6361 3159.2045 3177.9641 3228.8181 3597.9747
redmass: 3.4340 4.1134 3.3629 1.1797 4.2850 4.8759 5.2088 2.8465 5.5404 4.4828 1.3810 6.0372 3.0407 2.5242 6.3432 2.4320 5.4217 1.3489 2.1371 1.6152 7.8554 3.9453 1.3388 4.1907 1.9605 1.7292 1.2622 1.5136 1.6675 2.0261 1.6275 3.1487 2.8542 1.9194 4.3655 1.5032 2.2804 1.0497 1.9571 1.5984 2.9922 8.0597 7.2868 1.0338 1.1033 1.0984 1.0880 1.0917 1.0976 1.0983 1.0816
irintensity: 1.4393 1.3199 0.8468 0.0004 18.9141 1.9807 8.3520 11.4872 10.1517 1.7533 94.5490 6.8042 0.0834 21.6668 3.0032 0.0422 8.1788 21.4341 27.2390 77.6876 8.3585 6.8673 0.1731 36.9841 23.0437 6.8183 0.1964 26.2212 24.1740 97.4575 30.1605 38.9631 11.8387 97.9822 3.3690 32.4234 15.8528 13.1009 48.1443 2.7886 53.5450 12.8645 89.5761 64.0348 54.7664 25.0201 3.4490 7.8668 7.8132 1.3097 41.5959
temp: 298.150 k
press: 1.00000 atm
elementType: 8 7 7 6 6 6 6 6 6 6 6 1 1 1 1 1 1 1 1
symmnumber: 1
zpe: 387211.5 jmol-1
zpe.correction: 0.147481 hartree
zpe.thermalcorrener: 0.156272 hartree
zpe.thermalcorrenthalpy: 0.157216 hartree
zpe.thermalcorrgfe: 0.113689 hartree
zpe.sumelectzpe: -493.581638 hartree
zpe.sumelectthermal: -493.572848 hartree
zpe.sumelectthermalent: -493.571904 hartree
zpe.sumelectthermalfe: -493.615431 hartree
dipole: 1.5817 -5.0164 0.0001
dipole: 5.2598
quadrupole: -61.8777 -52.4109 -67.9840
quadrupole: 4.3752 0.0007 0.0001
quadrupole: -1.1202 8.3466 -7.2264 4.3752 0.0007 0.0001
hfenergy: -493.7291194 hartree
pointgroup: C01 [X(C8H8N2O1)]
dipole: -0.5826465 1.9856572 0.0000244 debye
dipolederiv: -1.6679407 0.3363887 0.0000081 0.3929435 -0.4438364 -0.0000036 -0.0000145 -0.0000137 -0.303092 -0.449385 0.1129132 -0.0000025 -0.1713929 -0.5283754 -0.000014 -0.0000138 -0.0000308 -0.2760678 -0.2605586 -0.0666401 0.0000008 0.0745621 -0.4944513 -0.0000018 -0.0000048 0.0000034 -0.2557772 0.2996201 0.1392498 0.0000069 0.3973486 0.2372926 0.0000154 -0.000001 0.0000165 0.0777954 0.1265877 0.1216395 0.0000086 -0.1017037 -0.1712493 0.0000002 0.0000104 0.0000025 -0.0310839 -0.31936 0.0003135 0. -0.2178679 -0.0937162 -0.000006 -0.0000048 -0.0000111 -0.257336 1.5048175 -0.223423 -0.0000019 -0.2159419 0.1719568 -0.0000122 0.0000253 -0.0000094 0.104487 0.2945389 0.075637 0.0000015 0.0680085 0.1790235 -0.0000045 -0.0000008 -0.0000023 -0.1188927 -0.4103231 0.0198575 0.0000047 0.3727102 -0.0250277 0.0000019 0.0000073 0.0000021 -0.2079289 0.096608 -0.2989366 0.0000001 -0.296445 0.578487 -0.000002 0.0000188 0.0000011 -0.0797023 0.4992563 -0.1436152 -0.0000032 -0.5357141 0.4881624 0.0000034 -0.0000189 0.0000047 0.339649 0.0502067 0.0552739 -0.0000033 0.0834446 -0.0568376 0.0000044 -0.0000032 0.0000075 0.1934842 0.0725166 0.0703217 -0.0000011 0.0408178 -0.0484944 0.000002 -0.0000012 0.0000027 0.1618552 0.1692482 0.0419193 -0.0000034 0.0450854 0.1679835 0.0000044 0.0000009 0.0000146 0.3590668 0.0234132 -0.0914822 -0.0000014 -0.0793812 0.0086208 0.0000004 0.0000016 -0.0000004 0.1747959 0.0040379 -0.0581716 -0.0000016 -0.0674437 0.0593029 0.0000005 -0.0000092 -0.0000028 0.1894112 0.0674423 -0.0512621 -0.0868173 0.1203458 -0.0573618 -0.0951502 -0.0132512 -0.1090798 -0.0967156 -0.1681756 0.0112686 0.0000158 -0.029739 0.0859052 0.0000037 0.0000166 0.0000015 0.1227681 0.0674496 -0.0512517 0.0867895 0.1203629 -0.0573845 0.0951581 0.0132425 0.1090938 -0.0967164 unknown
polarizability: 152.3830496|4.6230503|105.6549463|0.0007169|-0.0000864|46.7801962 unknown
InChI: InChI=1S/C8H8N2O/c1-11-6-2-3-7-8(4-6)10-5-9-7/h2-5,10H,1H3
charge 0 multiplicity 1
19 atoms
O  -2.915928 -0.160582 -0.000054
N  1.825774 1.525979 0.000004
N  2.688329 -0.591677 0.000031
C  0.712872 0.670783 -0.000027
C  1.272855 -0.651747 -0.000011
C  -0.677162 0.923656 -0.000038
C  -1.512975 -0.217496 -0.000043
C  0.405343 -1.771004 -0.000015
C  -0.978957 -1.544606 -0.000032
C  2.974966 0.7165 0.000012
C  -3.539649 1.158578 0.000047
H  -1.081177 1.939979 -0.000058
H  0.811989 -2.786594 0.0000
H  1.809185 2.544147 -0.000025
H  -1.688554 -2.377208 -0.000035
H  3.979204 1.136423 0.000025
H  -3.264289 1.737913 0.904475
H  -4.623509 0.969765 0.000115
H  -3.264418 1.737991 -0.90437
