program: Gaussian 09
title: 000078579
version: EM64L-G09RevD.01
frameworkgroup: C1[X(C2H4O3)]
method: RPBEPBE
basis: SDD
operation: Freq
keyword: #p
keyword: freq=noraman
keyword: PBEPBE/SDD
title: #p freq=noraman PBEPBE/SDD
converged: YES YES YES YES
title: Mulliken charges:
elementType: O O O C C H H H H
charge: -0.230612 -0.390457 -0.274215 -0.498622 0.278703 0.245240 0.241937 0.245236 0.382788
chargesum: 0.00000
title: Mulliken charges with hydrogens summed into heavy atoms:
elementType: O O O C C
charge: -0.230612 -0.007669 -0.274215 0.233792 0.278703
polarizability: 4.21618611e+01 8.16068423e-01 3.26263567e+01 1.02834081e-03 1.28959796e-03 2.01213215e+01
1716.lowfreq: -8.1010 -6.5042 0.0007 0.0009 0.0010 1.8962 86.0483 167.3738 265.6986
frequency: 85.9786 167.3728 265.6980 475.0542 518.2295 606.1431 700.5772 819.0053 1004.2059 1102.8988 1119.1311 1158.9589 1336.3361 1431.6578 1454.2099 1464.3666 1645.5979 3008.2318 3111.0820 3157.4968 3573.9047
redmass: 1.1099 3.6768 3.8266 5.2161 1.0933 6.3930 11.7293 5.3886 6.4825 2.4169 1.2546 1.4375 2.1944 1.2180 1.0491 1.0524 8.3003 1.0300 1.1051 1.1045 1.0652
irintensity: 0.2797 9.7636 12.5413 43.0150 158.5073 0.2643 34.7511 14.5192 14.3169 505.0766 0.0207 1.5605 124.8131 40.9205 15.5130 12.2500 321.8546 27.6339 26.7450 13.8777 54.6269
temp: 298.150 k
press: 1.00000 atm
elementType: 8 8 8 6 6 1 1 1 1
symmnumber: 1
zpe: 168710.2 jmol-1
zpe.correction: 0.064258 hartree
zpe.thermalcorrener: 0.069862 hartree
zpe.thermalcorrenthalpy: 0.070806 hartree
zpe.thermalcorrgfe: 0.035333 hartree
zpe.sumelectzpe: -303.869857 hartree
zpe.sumelectthermal: -303.864254 hartree
zpe.sumelectthermalent: -303.863309 hartree
zpe.sumelectthermalfe: -303.898782 hartree
dipole: -0.7770 0.2132 0.0003
dipole: 0.8057
quadrupole: -18.0797 -36.6815 -28.4572
quadrupole: 0.7251 0.0008 -0.0006
quadrupole: 9.6598 -8.9420 -0.7177 0.7251 0.0008 -0.0006
hfenergy: -303.9341154 hartree
pointgroup: C01 [X(C2H4O3)]
dipole: -0.3021976 -0.0956474 -0.0001117 debye
dipolederiv: -1.3797235 0.1574138 0.0000098 0.3873567 -0.5446665 -0.0000641 -0.0001315 0.0000326 -0.2954269 -1.0846633 -0.4879836 -0.0000332 -0.5028696 -0.5030496 0.000024 0.0001644 0.000159 -0.4326358 -0.6573579 0.0278087 0.0000162 0.0888533 -1.0533795 0.0001299 0.0000722 -0.0002339 -0.3429746 0.7036818 0.039609 0.000041 0.1513351 0.2286557 0.0000224 0.0000255 0.0000091 0.2895572 2.0924077 0.0921476 -0.00008 -0.1846685 1.6208625 -0.0000835 -0.0002108 0.000047 0.3533251 0.0157881 -0.0024863 0.0221137 -0.0906168 0.0395263 -0.099627 -0.0281862 -0.0923683 -0.0553401 -0.0285541 0.0725374 -0.0000132 0.1198173 -0.0022563 0.0000121 -0.0000217 0.0000046 0.1283604 0.0158149 -0.0025208 -0.0220833 -0.09066 0.0395095 0.0996191 0.028216 0.09238 -0.0553295 0.3226063 0.1034743 0.000029 0.1214525 0.1747978 -0.0000328 0.0000721 -0.0000302 0.4104643 unknown
polarizability: 42.2107434|-0.4443664|32.5774745|-0.0010775|0.0012488|20.1213215 unknown
InChI: InChI=1S/C2H4O3/c1-5-2(3)4/h3H,1H3
charge 0 multiplicity 1
9 atoms
O  -0.642618 0.713799 0.000104
O  1.589184 0.759691 -0.000068
O  0.517742 -1.328992 -0.000119
C  -1.923013 -0.034209 -0.000116
C  0.48102 -0.077913 0.000237
H  -1.995812 -0.667028 -0.900265
H  -2.696063 0.745671 -0.000196
H  -1.996065 -0.667101 0.899961
H  2.405826 0.196282 -0.000338
