program: Gaussian 09
title: 000078585
version: EM64L-G09RevD.01
frameworkgroup: C1[X(C9H9F3N2S)]
method: RPBEPBE
basis: SDD
operation: Freq
keyword: #p
keyword: freq=noraman
keyword: PBEPBE/SDD
title: #p freq=noraman PBEPBE/SDD
converged: YES YES NO NO
title: Mulliken charges:
elementType: S F F F N N C C C C C C C C C H H H H H H H H H
charge: 0.270252 -0.181916 -0.154167 -0.162655 0.005232 0.045725 -0.507584 -0.611593 -0.395893 0.212507 0.241888 -0.284920 -0.767719 -0.280496 0.259964 0.247869 0.260385 0.285785 0.297154 0.240219 0.253708 0.237587 0.236084 0.252582
chargesum: 0.00000
title: Mulliken charges with hydrogens summed into heavy atoms:
elementType: S F F F N N C C C C C C C C C
charge: 0.270252 -0.181916 -0.154167 -0.162655 0.005232 0.045725 0.000671 -0.028653 -0.395893 0.212507 0.241888 -0.044701 -0.040340 -0.027914 0.259964
polarizability: 1.89495382e+02 7.95442749e+00 1.27149816e+02 1.43695050e+01 -6.43403296e+00 8.06427610e+01
1716.lowfreq: -24.8737 -4.2423 -0.0012 -0.0005 0.0021 5.7760 6.7127 11.9568 29.7333
frequency: -24.3177 11.7676 29.7199 35.3912 72.6832 87.7634 141.1477 149.2578 172.5532 195.8501 221.8573 259.9747 300.4928 329.4688 383.6400 407.6723 425.3478 452.4745 477.4968 501.8434 530.6038 570.1008 576.4391 632.6788 690.4884 697.5905 776.4257 839.0270 861.4616 881.3623 929.8192 934.4355 973.4752 986.7771 988.4287 1046.9251 1056.4468 1079.7764 1139.9496 1169.8349 1188.1847 1210.1341 1221.7744 1238.9385 1265.5283 1291.0024 1310.8103 1342.2747 1391.1149 1396.4276 1438.0549 1444.6663 1454.9390 1466.9930 1524.8480 1537.6745 1773.2051 2987.6317 2988.6575 3056.1390 3068.7152 3068.7431 3120.4976 3134.7676 3141.5962 3174.2534
redmass: 1.0542 7.7767 12.0887 5.9400 8.0626 5.8207 8.4253 6.5516 4.4352 4.2705 3.8803 4.2777 6.0895 4.0591 4.0840 5.7000 3.4827 6.8647 9.2780 8.3807 6.0899 5.3386 3.8474 4.7782 4.3256 7.6755 6.0955 1.2413 4.3249 2.2368 3.5955 2.7447 1.4108 1.6455 3.7948 1.6132 2.4031 1.7183 1.4452 10.9255 2.9456 1.3717 2.3537 8.4130 2.8561 1.4514 2.1556 1.5390 1.2701 2.0542 1.0849 1.0915 1.1529 1.0457 4.0694 5.8397 10.7356 1.0648 1.0381 1.0623 1.0916 1.0971 1.0987 1.1081 1.0903 1.0973
irintensity: 0.3301 0.6361 0.1946 0.1130 2.0676 1.1136 0.8199 2.7959 0.3316 0.5653 6.5699 1.6362 5.7870 2.2895 3.7206 4.3291 2.6091 7.9537 0.7235 5.3197 7.2059 4.4209 2.2408 0.9090 3.2934 15.4679 0.2101 31.8807 28.6680 21.3596 30.0086 6.8377 0.0754 23.6717 46.0101 9.8924 66.5701 5.9976 37.5623 194.8660 133.5430 10.6181 28.4562 7.7516 13.9087 69.2049 46.5317 5.8789 20.5120 164.7631 8.1885 27.9813 47.5450 16.2250 156.5899 165.3826 57.9152 13.2236 10.9252 7.2146 5.7846 13.5686 8.8125 4.9619 14.5183 14.2330
temp: 298.150 k
press: 1.00000 atm
elementType: 16 9 9 9 7 7 6 6 6 6 6 6 6 6 6 1 1 1 1 1 1 1 1 1
symmnumber: 1
zpe: 438168.3 jmol-1
zpe.correction: 0.166889 hartree
zpe.thermalcorrener: 0.181547 hartree
zpe.thermalcorrenthalpy: 0.182491 hartree
zpe.thermalcorrgfe: 0.121608 hartree
zpe.sumelectzpe: -1154.285250 hartree
zpe.sumelectthermal: -1154.270592 hartree
zpe.sumelectthermalent: -1154.269648 hartree
zpe.sumelectthermalfe: -1154.330531 hartree
dipole: 4.3866 2.9784 -1.5938
dipole: 5.5365
quadrupole: -78.1120 -94.9021 -93.9335
quadrupole: -0.9151 8.8443 -4.4050
quadrupole: 10.8705 -5.9195 -4.9510 -0.9151 8.8443 -4.4050
hfenergy: -1154.4521394 hartree
pointgroup: C01 [X(C9H9F3N2S1)]
dipole: -1.755899 -1.2879283 0.0527568 debye
dipolederiv: -0.8487571 0.2075638 0.0256735 0.1289144 -0.0279019 -0.0567528 0.1129965 -0.0607302 -0.0485135 -0.2710159 -0.0817417 0.0697292 -0.1009224 -0.1827445 -0.0234446 0.1418604 0.0957336 -0.7427404 -0.5692857 -0.3493028 -0.1713551 -0.5386505 -0.4154375 -0.2126318 -0.3562005 -0.2741894 -0.4380853 -0.3495181 -0.1319869 0.1723739 -0.1649539 -0.1949905 0.0454374 0.3559426 0.1251274 -0.7443175 -1.1887306 -0.0083016 0.1697098 -0.4601605 -0.3841749 0.193271 0.4274146 0.1171918 -0.2781301 -1.1532583 0.1224871 0.0913291 0.5947452 -0.4831851 0.0595663 -0.1167148 0.1293193 -0.2349403 0.0485815 -0.0450164 -0.0293209 0.1002076 0.0464095 -0.0596343 0.0007697 0.0485758 -0.0195 0.228333 -0.1573427 0.0837402 -0.3363935 0.2466406 -0.0642347 0.0780422 -0.0925784 0.0876591 2.0006768 -0.301707 -0.1567154 -0.1813243 0.2378872 -0.0800236 -0.2989173 -0.0475218 0.0942859 0.1308082 0.133048 -0.0530216 0.1714448 0.0750345 0.0615143 -0.0552733 -0.0933322 0.7330536 0.6686829 0.0342833 -0.1213588 0.2627317 0.5886476 -0.3071226 -0.2444132 -0.2718767 0.2453314 -0.2359945 0.0163296 0.0008661 -0.1557404 -0.5313209 0.2331967 0.0992383 0.2020995 -0.2454168 -0.1367854 -0.1765234 0.1191924 -0.1333837 -0.1257982 0.1014997 0.1016504 0.1129727 -0.0485706 0.6399152 0.0505982 -0.1452534 -0.0795865 0.3897944 -0.1985393 -0.0890946 -0.2212692 0.1009052 0.9222849 0.5179245 0.0068367 0.7269091 0.6168077 0.1652362 -0.0931251 0.1282736 1.1413334 -0.0339182 0.0223218 -0.0387593 0.0130227 -0.0958738 0.0331224 -0.0679563 0.0519101 0.1007643 0.0724078 -0.0104664 0.0378509 -0.0794039 0.1248826 0.0372426 0.0578261 -0.0203631 -0.0342619 -0.0273403 -0.0539462 -0.0536858 0.0208329 -0.0795763 -0.026351 -0.0858482 -0.0133265 0.0423461 0.0646172 0.0247807 0.0302063 0.092699 0.009279 0.0359658 0.0340177 0.0376378 -0.0400291 -0.094661 0.0251269 0.0365541 0.0110264 0.1218488 0.0212114 0.0451899 0.0182907 0.1494285 0.0402465 0.1330508 -0.0495883 0.0503453 0.0059897 0.0454124 -0.009989 0.028663 0.1030668 0.0749499 0.025395 0.0839803 0.0240662 0.0404889 -0.064042 0.0989253 -0.0169399 -0.0464999 -0.003599 -0.0738024 -0.0872151 -0.0702699 0.042823 0.0041441 -0.1025935 -0.0432934 0.0249993 0.02136 0.0772275 -0.0217686 0.1038443 -0.0255298 0.0559565 -0.0337479 0.0596255 0.0978317 unknown
polarizability: 191.1433021|-1.8202366|117.7552945|-10.1328422|-19.6775108|88.389362 unknown
InChI: InChI=1S/C9H9F3N2S/c1-6-2-4-13-9(14-6)15-5-3-7(10)8(11)12/h2,4H,3,5H2,1H3
charge 0 multiplicity 1
24 atoms
S  0.184067 0.449385 -0.785391
F  2.617267 -0.646679 2.145746
F  4.647907 1.049326 1.228745
F  4.309136 0.392833 -0.930491
N  -2.216817 -0.508501 0.155174
N  -2.199739 1.671452 -0.947919
C  2.098878 -1.494468 -0.098781
C  0.580485 -1.229891 0.000471
C  -1.606316 0.531014 -0.48557
C  2.922843 -0.589922 0.769038
C  -3.567408 -0.402727 0.366894
C  -4.276881 0.745795 -0.07329
C  -4.250256 -1.547599 1.077606
C  -3.543802 1.758567 -0.730382
C  3.912124 0.244786 0.388356
H  2.274964 -2.541997 0.219229
H  2.445002 -1.411941 -1.144233
H  0.01126 -1.999266 -0.542695
H  0.234163 -1.206441 1.044173
H  -5.353449 0.842254 0.089839
H  -3.514755 -2.328586 1.32329
H  -4.730191 -1.203371 2.012316
H  -5.04342 -1.989067 0.446363
H  -4.028463 2.669443 -1.098086
