program: Gaussian 09
title: 000078678
version: EM64L-G09RevD.01
frameworkgroup: C1[X(C22H28Cl2N2)]
method: RPBEPBE
basis: SDD
operation: Freq
keyword: #p
keyword: freq=noraman
keyword: PBEPBE/SDD
title: #p freq=noraman PBEPBE/SDD
converged: YES YES NO NO
title: Mulliken charges:
elementType: Cl Cl N N C C C C C C C C C C C C C C C C C C C C C C H H H H H H H H H H H H H H H H H H H H H H H H H H H H
charge: -0.068580 -0.068373 -0.333021 -0.332434 0.014285 0.013705 -0.473973 -0.426556 -0.427071 -0.473031 -0.369970 -0.368948 -0.567313 -0.568035 0.601782 0.601772 -0.330586 -0.330663 -0.408528 -0.408385 -0.229228 -0.229290 -0.234223 -0.234229 -0.231525 -0.231553 0.178465 0.178469 0.182955 0.212869 0.212977 0.201402 0.201541 0.213121 0.213098 0.182776 0.239162 0.238962 0.229067 0.196838 0.196191 0.229261 0.250103 0.198148 0.198349 0.250004 0.236545 0.236598 0.254164 0.254178 0.230280 0.230265 0.234092 0.234092
chargesum: 0.00000
title: Mulliken charges with hydrogens summed into heavy atoms:
elementType: Cl Cl N N C C C C C C C C C C C C C C C C C C C C C C
charge: -0.068580 -0.068373 -0.093859 -0.093472 0.192750 0.192173 -0.078149 -0.012177 -0.012409 -0.077157 0.055935 0.056505 -0.119062 -0.119682 0.601782 0.601772 -0.330586 -0.330663 -0.171983 -0.171787 0.024936 0.024888 -0.003943 -0.003964 0.002567 0.002539
polarizability: 3.54436295e+02 -2.08423055e+01 2.66449422e+02 4.80130238e+01 -5.52379406e-01 1.77846839e+02
1716.lowfreq: -12.0173 -4.3501 -1.9699 -0.0028 -0.0018 0.0009 5.5929 10.9313 15.7021
frequency: -2.3028 10.9295 15.1261 17.1062 24.1487 40.9004 50.6184 77.3952 79.6317 115.2557 122.1121 123.8267 143.0307 153.6688 169.6533 187.7341 212.3606 232.6612 245.8772 258.8518 261.1283 287.3080 308.4608 347.0447 358.9033 371.3180 378.8269 425.3863 425.6211 437.1103 440.3930 452.2767 459.0334 471.8576 490.8494 532.4036 537.8881 555.8612 598.9772 620.6480 661.2292 662.4866 663.0879 678.3838 727.6775 727.7769 757.6212 757.8761 775.7499 789.3528 797.0590 798.0568 822.2729 824.7391 865.6221 866.8826 869.2617 898.7672 938.0539 945.1695 945.9123 969.2545 983.6868 983.7966 998.6932 1007.9331 1013.7226 1025.0371 1027.9182 1038.2834 1038.9556 1041.9497 1042.9621 1050.2957 1066.5941 1075.1337 1102.3412 1118.4267 1130.3779 1130.8064 1142.8321 1147.3842 1150.9920 1169.5101 1172.0625 1176.8458 1199.1874 1214.5065 1215.2780 1220.9148 1236.0621 1247.7600 1266.5834 1267.5497 1272.8572 1279.2627 1289.7894 1291.0389 1301.9497 1302.3770 1308.7693 1319.3948 1338.0331 1338.7063 1351.7423 1363.2876 1372.5888 1374.2939 1375.9124 1378.9209 1424.5006 1424.6206 1456.4371 1461.8809 1462.8083 1462.9735 1465.1205 1466.8812 1471.2397 1471.3234 1473.0325 1476.6126 1492.6753 1493.1138 1574.1162 1574.1809 1605.8358 1605.8969 2826.4639 2827.3910 2859.9257 2860.3045 2961.8459 2962.4958 2984.3723 2987.2333 2987.3985 2987.4409 3017.6988 3019.9471 3039.2802 3040.1228 3046.1071 3048.6136 3065.9198 3065.9740 3123.8937 3123.9923 3140.6971 3140.7289 3157.7073 3157.7859 3173.4492 3173.5092 3407.8617 3408.3480
redmass: 6.8778 6.8804 5.3992 5.3888 4.4017 4.3818 5.5024 4.1272 4.7478 3.0330 2.1546 4.0186 4.1957 3.0460 3.9225 4.8908 1.7992 4.7461 4.4571 4.9469 2.7414 3.6525 3.2477 4.8064 4.5168 3.2311 3.1467 3.8110 3.8080 2.1578 3.3830 3.3726 2.9639 2.8673 3.2383 4.1040 3.4353 3.0487 5.0542 3.1967 2.6882 4.9965 2.1434 1.6336 3.9316 3.9177 1.2475 1.2415 2.2784 1.4634 1.1889 1.2575 3.6745 3.8090 1.5359 1.4182 1.9264 1.4078 2.0038 1.3893 1.4347 2.1939 1.3302 1.3290 2.5348 3.0076 5.6113 2.9438 2.9790 2.3858 2.8944 2.2603 2.0774 1.5104 1.4087 2.3967 2.3217 1.7094 1.8856 1.6433 4.3658 3.8177 1.4654 1.0942 1.0696 1.1122 1.5179 2.1373 2.2601 1.4342 1.4050 1.2399 1.2956 1.3147 1.2710 1.2278 1.2432 1.2642 1.4520 1.3322 1.2436 1.2898 1.4636 1.4554 1.5514 1.3864 2.5611 5.7532 2.3060 1.5508 2.1586 2.1609 1.1920 1.1020 2.3599 2.3372 1.1468 1.2586 1.1433 1.1391 1.0994 1.0963 1.0832 1.0839 6.0803 6.0816 7.2189 7.2189 1.0807 1.0808 1.0718 1.0718 1.0595 1.0588 1.0620 1.0621 1.0637 1.0638 1.0993 1.1007 1.0884 1.0868 1.0991 1.1006 1.0993 1.0994 1.0875 1.0875 1.0891 1.0892 1.0947 1.0947 1.0998 1.0998 1.0738 1.0738
irintensity: 0.8124 0.4199 0.0004 0.3330 0.0006 0.0009 0.7980 0.0007 0.2830 0.0105 7.2636 0.0801 1.2744 0.0014 2.4277 0.0002 0.2915 2.0654 0.0003 2.4137 0.0010 2.8093 0.0013 0.0008 7.2475 0.0088 15.0038 2.7183 2.5438 12.4598 0.0308 0.0112 19.4466 0.0031 0.0004 5.4148 0.0008 52.8209 0.0043 18.1941 0.8828 48.6815 0.1308 81.0771 2.8769 0.2204 17.2165 164.0658 0.0002 0.0006 5.2231 0.0311 7.2728 0.0060 2.2265 0.0031 3.4373 6.6140 5.3509 0.0064 4.7207 7.9324 0.0130 0.0526 0.0013 38.9029 0.0278 48.4259 0.0017 0.6213 13.5177 13.0483 0.0394 0.0055 0.0017 17.4106 4.1262 0.0012 6.0353 24.0378 0.2693 192.0745 0.5513 3.3715 0.0003 17.5014 0.0040 2.6075 0.0001 4.5143 4.9515 0.0007 0.0025 8.5305 32.6451 0.0203 16.1728 0.1573 1.3919 0.1678 22.2704 0.0022 0.0141 6.6055 0.0283 28.3432 0.0151 7.1141 0.0536 21.6808 5.0750 29.8662 0.0015 9.0715 44.7863 21.4684 0.0058 35.5180 2.9666 17.7595 18.1914 0.0021 14.5697 3.5099 5.3833 10.3212 0.8545 0.5440 72.4543 62.6704 124.6813 78.0391 90.4089 1.6179 57.0322 0.0014 19.0088 39.7464 71.1169 0.1596 2.0650 24.7817 0.0191 119.0000 7.2396 24.1102 6.7450 6.7203 9.5561 10.0904 17.8758 17.8791 18.3054 12.6768 4.9384 2.4160
temp: 298.150 k
press: 1.00000 atm
elementType: 17 17 7 7 6 6 6 6 6 6 6 6 6 6 6 6 6 6 6 6 6 6 6 6 6 6 1 1 1 1 1 1 1 1 1 1 1 1 1 1 1 1 1 1 1 1 1 1 1 1 1 1 1 1
symmnumber: 1
zpe: 1185544.4 jmol-1
zpe.correction: 0.451550 hartree
zpe.thermalcorrener: 0.476377 hartree
zpe.thermalcorrenthalpy: 0.477321 hartree
zpe.thermalcorrgfe: 0.392262 hartree
zpe.sumelectzpe: -1882.809305 hartree
zpe.sumelectthermal: -1882.784479 hartree
zpe.sumelectthermalent: -1882.783534 hartree
zpe.sumelectthermalfe: -1882.868594 hartree
dipole: 0.0260 0.0260 0.0544
dipole: 0.0656
quadrupole: -144.9009 -160.8710 -174.4850
quadrupole: -24.0450 17.2828 5.3223
quadrupole: 15.1848 -0.7854 -14.3994 -24.0450 17.2828 5.3223
hfenergy: -1883.2608555 hartree
pointgroup: C01 [X(C22H28Cl2N2)]
dipole: -0.0099562 0.0102803 -0.0214826 debye
polarizability: 355.8401907|18.6714242|265.241294|47.382574|-1.9032714|177.6510709 unknown
InChI: InChI=1S/C22H28Cl2N2/c23-21-7-3-1-5-17(21)13-15-25-19-9-11-20(12-10-19)26-16-14-18-6-2-4-8-22(18)24/h1-8,19-20,25-26H,9-16H2
charge 0 multiplicity 1
54 atoms
Cl 6.067596 -2.390622 -0.492571
Cl -6.036215 2.392241 0.55983
N  2.655636 0.675557 -0.925931
N  -2.65237 -0.699435 0.905887
C  1.403603 0.525331 -0.141754
C  -1.400877 -0.548922 0.120863
C  0.222857 1.106462 -0.953178
C  1.125917 -0.96177 0.191902
C  -1.123189 0.938116 -0.212898
C  -0.220097 -1.13026 0.932204
C  3.917971 0.509661 -0.177459
C  -3.915293 -0.51739 0.162165
C  5.125702 0.563891 -1.14968
C  -5.122219 -0.587586 1.134425
C  6.453781 0.401231 -0.434043
C  -6.448957 -0.393224 0.424182
C  6.984528 -0.858515 -0.063507
C  -6.967545 0.881339 0.088596
C  7.225009 1.538572 -0.070245
C  -7.23061 -1.512709 0.028648
C  8.204152 -1.009948 0.623811
C  -8.1851 1.063397 -0.594875
C  8.450203 1.421931 0.621438
C  -8.453958 -1.365206 -0.660393
C  8.943015 0.143882 0.970115
C  -8.934416 -0.073354 -0.973707
H  1.458876 1.087369 0.828382
H  -1.456542 -1.110607 -0.84955
H  0.402321 2.181756 -1.160469
H  0.189028 0.588675 -1.933629
H  1.120123 -1.527136 -0.76078
H  1.942953 -1.380192 0.809849
H  -1.939802 1.356537 -0.83137
H  -1.117477 1.5038 0.739616
H  -0.18656 -0.612612 1.912684
H  -0.399643 -2.205561 1.13941
H  2.653188 1.564758 -1.447986
H  -2.654155 -1.594502 1.417898
H  3.909347 -0.476082 0.320471
H  4.057305 1.277698 0.625066
H  -4.057001 -1.269861 -0.654594
H  -3.905858 0.477771 -0.316662
H  4.98049 -0.228743 -1.905047
H  5.115515 1.535948 -1.681321
H  -5.120452 -1.573583 1.639811
H  -4.96885 0.183416 1.910298
H  6.846724 2.530469 -0.34583
H  -6.861916 -2.515401 0.276767
H  8.568808 -2.008898 0.88028
H  -8.540185 2.072522 -0.823459
H  9.018522 2.320767 0.883418
H  -9.03046 -2.250978 -0.947774
H  9.893358 0.038092 1.503902
H  -9.883277 0.056111 -1.504909
