program: Gaussian 09
title: 000078581
version: EM64L-G09RevD.01
frameworkgroup: C1[X(C5H6N2O2)]
method: RPBEPBE
basis: SDD
operation: Freq
keyword: #pfreq=noraman
keyword: PBEPBE/SDD
title: #p freq=noraman PBEPBE/SDD
converged: NO YES NO NO
title: Mulliken charges:
elementType: O O N N C C C C C H H H H H H
charge: -0.251461 -0.259013 -0.102829 -0.623233 0.152467 0.094677 -0.731868 0.156784 -0.128955 0.241399 0.250408 0.250842 0.268407 0.343353 0.339021
chargesum: 0.00000
title: Mulliken charges with hydrogens summed into heavy atoms:
elementType: O O N N C C C C C
charge: -0.251461 -0.259013 -0.102829 0.059142 0.152467 0.094677 0.010781 0.156784 0.139452
polarizability: 9.28735653e+01 8.86826742e-01 8.50198247e+01 -6.87260324e-03 1.39864006e-02 3.61806537e+01
1716.lowfreq: -96.8763 -14.7307 -8.7574 -5.0946 -0.0009 -0.0008 -0.0007 74.6150 155.0674
frequency: -96.8664 74.6057 155.0659 168.7145 264.5309 303.2140 402.5745 484.6985 533.3592 552.9664 617.5892 633.1735 653.5086 670.3256 740.5077 784.8559 885.1963 928.7796 991.0206 1044.8560 1048.2109 1075.5065 1121.3233 1232.8306 1278.9596 1386.2749 1406.0746 1429.8833 1454.7739 1463.2194 1578.4298 1593.6181 1627.8246 3003.1962 3082.5458 3123.6948 3271.7497 3521.7094 3679.0105
redmass: 1.0188 5.2084 4.4113 7.3700 3.6246 3.1781 6.7865 3.9674 1.4328 1.1819 2.3346 4.6313 4.3116 4.3932 7.0979 1.4943 10.6261 2.4499 6.7645 1.4974 2.0526 2.6914 3.5798 1.5651 3.5598 3.0515 1.5797 4.6464 1.0435 1.1046 1.9252 7.3737 2.4886 1.0372 1.0966 1.1006 1.1006 1.0447 1.1050
irintensity: 0.2727 10.8277 9.9462 0.0754 7.7814 0.4929 0.9581 5.4610 4.0580 236.2964 89.1767 29.6936 3.5956 6.9533 7.9221 29.7559 20.1483 5.5303 28.4286 6.7668 13.7201 10.1667 14.6360 2.6267 49.1172 140.6891 47.2259 29.9451 16.0339 6.9843 113.8184 57.6483 315.9996 5.9623 8.2406 11.9902 1.2267 56.8124 42.0643
temp: 298.150 k
press: 1.00000 atm
elementType: 8 8 7 7 6 6 6 6 6 1 1 1 1 1 1
symmnumber: 1
zpe: 288709.0 jmol-1
zpe.correction: 0.109963 hartree
zpe.thermalcorrener: 0.117697 hartree
zpe.thermalcorrenthalpy: 0.118641 hartree
zpe.thermalcorrgfe: 0.077330 hartree
zpe.sumelectzpe: -453.414795 hartree
zpe.sumelectthermal: -453.407062 hartree
zpe.sumelectthermalent: -453.406118 hartree
zpe.sumelectthermalfe: -453.447429 hartree
dipole: 0.5387 -3.3037 -0.0015
dipole: 3.3473
quadrupole: -52.1109 -46.9352 -53.1408
quadrupole: -6.3260 -0.0243 0.0167
quadrupole: -1.3820 3.7938 -2.4118 -6.3260 -0.0243 0.0167
hfenergy: -453.5247589 hartree
pointgroup: C01 [X(C5H6N2O2)]
dipole: 0.1508383 -1.3082587 0.0008198 debye
dipolederiv: -0.5677424 0.1888993 -0.000621 0.2158099 -0.6494632 0.0007217 -0.0004752 0.0005014 -0.0956927 -0.7709012 -0.19952 -0.0000082 -0.1120135 -0.9224973 -0.0010266 0.000586 0.0027407 -0.3591254 -0.3129363 -0.0550033 0.0001525 0.0324592 -0.5370857 0.0005893 0.0001544 0.0003523 -0.247326 -0.743378 0.5022109 -0.0015579 0.498241 -0.8547467 0.0001749 -0.0009246 -0.0010562 -0.7102126 0.2013696 0.0315881 -0.0000717 -0.1136817 0.607149 -0.00039 -0.0011434 0.0003967 0.0303258 -0.578508 0.0936005 0.0004544 -0.0090459 0.1563045 0.0000021 -0.0010647 -0.0000143 -0.0117079 0.1350926 -0.0908777 0.0003933 0.0286203 -0.2127569 0.0001409 0.0018661 -0.0011818 0.0354576 1.6891321 -0.2843666 -0.0004979 -0.227887 1.4207277 0.0010214 -0.0003464 -0.0008971 0.2838013 0.3918423 -0.1651189 0.0006206 -0.2572255 0.3905931 -0.0007292 0.0005954 -0.0003703 -0.0119323 -0.0846151 0.1085281 -0.0017793 0.0244902 0.0751675 0.000257 -0.0017242 0.0009407 0.124138 0.0612882 -0.0199689 -0.0869196 0.009151 0.0518133 -0.0323191 -0.0634003 -0.0621532 -0.0128623 0.059215 -0.0208369 0.0882747 0.0085164 0.0531105 0.0316907 0.064025 0.0614995 -0.0099458 0.0924538 -0.0183265 0.0000525 -0.0169077 0.0487542 0.0001842 -0.0002731 0.0000379 0.2003728 0.2209397 -0.0351867 0.0008625 -0.0665634 0.195155 -0.0001274 0.0011606 -0.0006228 0.3957786 0.2067476 -0.0356214 0.0006452 -0.0139632 0.177775 -0.00019 0.0009643 -0.0001736 0.388931 unknown
polarizability: 92.9393047|0.5153931|84.9540321|-0.036385|-0.0414553|36.1807068 unknown
InChI: InChI=1S/C5H6N2O2/c1-3-4(5(6)8)9-2-7-3/h2H,6H2,1H3
charge 0 multiplicity 1
15 atoms
O  -0.337197 -1.51749 0.002307
O  2.078425 1.248335 -0.003652
N  -2.135737 -0.103412 -0.000341
N  2.395593 -1.069307 -0.001608
C  -0.947863 0.682142 -0.000763
C  0.149192 -0.172947 0.001438
C  -0.988951 2.178476 -0.002574
C  1.606784 0.06785 0.001846
C  -1.737314 -1.36516 0.001947
H  -2.035944 2.518891 -0.010841
H  -0.47519 2.59008 0.883656
H  -0.460982 2.588373 -0.881113
H  -2.332779 -2.273173 0.002877
H  1.984367 -2.001945 -0.001309
H  3.407996 -0.955913 -0.005468
