program: Gaussian 09
title: 000078605
version: EM64L-G09RevD.01
frameworkgroup: C1[X(C12H14O)]
method: RPBEPBE
basis: SDD
operation: Freq
keyword: #pfreq=noraman
keyword: PBEPBE/SDD
title: #p freq=noraman PBEPBE/SDD
converged: YES YES NO NO
title: Mulliken charges:
elementType: O C C C C C C C C C C C C H H H H H H H H H H H H H H
charge: -0.203331 -0.213138 -0.443802 -0.443651 -0.511700 -0.511240 0.547202 0.202443 -0.469149 -0.396392 -0.220448 -0.247214 -0.245525 0.198317 0.230195 0.214678 0.216668 0.230121 0.217570 0.245659 0.245952 0.217221 0.231858 0.228365 0.225479 0.224626 0.229235
chargesum: 0.00000
title: Mulliken charges with hydrogens summed into heavy atoms:
elementType: O C C C C C C C C C C C C
charge: -0.203331 -0.014821 0.001071 0.003139 -0.048471 -0.048066 0.547202 0.202443 -0.237291 -0.168026 0.005031 -0.022588 -0.016291
polarizability: 1.69949458e+02 3.10802883e+00 1.14331406e+02 -4.61119480e-01 -6.29283556e+00 8.70153859e+01
1716.lowfreq: -19.8927 -2.8148 -0.0005 -0.0003 0.0005 11.8228 33.2422 50.8992 89.8263
frequency: 32.8979 50.7723 89.7461 136.0712 172.4018 239.9502 278.4365 289.3549 403.4377 409.8325 412.8544 464.1235 472.1824 534.8859 592.5921 616.5766 673.7075 706.2520 736.7588 759.4136 768.6398 811.6465 851.6760 873.6406 899.5186 910.4336 948.3914 963.6048 973.8875 990.6019 994.4996 1025.7300 1029.1746 1065.5634 1071.7480 1100.1825 1101.8616 1165.3487 1172.0196 1187.8337 1191.0585 1208.4274 1248.1897 1255.7054 1277.4706 1281.3065 1309.2958 1320.7191 1331.9906 1335.0977 1359.3974 1384.8387 1439.7358 1441.8224 1449.6314 1466.2388 1475.7631 1484.0765 1592.3981 1613.2926 1635.2314 2956.4189 2965.2291 2971.8886 2985.0604 2989.8986 3046.6849 3052.6004 3070.5272 3073.2856 3113.5020 3117.4064 3132.4439 3143.3843 3162.3744
redmass: 3.7094 6.9092 3.7696 3.5460 2.0317 4.8518 3.5931 2.8945 2.8094 3.2174 2.1448 2.4078 3.5001 3.0179 4.9005 6.4031 4.0214 1.6767 3.4032 1.5288 1.9658 2.3643 1.2473 3.0438 1.4200 1.4729 2.0743 2.3884 1.3902 6.1482 1.3184 2.3260 2.0490 1.2061 1.8134 2.1967 2.1762 2.1431 1.0580 1.2017 1.1458 2.1751 1.4501 1.5919 1.3670 1.4929 1.3540 1.3828 1.3088 1.4821 1.5369 5.2220 1.1062 1.9184 1.1332 1.0860 1.1745 1.9908 5.9276 6.1470 9.2940 1.0821 1.0651 1.0656 1.0607 1.0616 1.1012 1.1014 1.0960 1.0969 1.0873 1.0862 1.0906 1.0957 1.1014
irintensity: 0.3459 3.9029 0.0933 0.9057 2.1441 0.4549 1.2409 0.0544 0.0042 2.3029 2.2898 0.7289 11.4787 9.2192 2.6370 0.0746 0.7490 52.6162 2.1565 11.3401 43.6640 6.9547 0.0054 0.4266 0.3800 9.1544 8.4326 10.4056 0.0722 0.7934 0.0103 0.5879 8.8467 0.2991 8.1441 3.3549 3.2457 43.3971 0.1039 8.5854 4.3309 0.5105 0.4678 10.2620 6.2526 3.1780 2.1904 8.8847 0.5938 4.0406 1.1157 0.1470 15.4927 13.6608 13.6450 8.9198 5.8632 22.3135 1.8222 12.1186 189.7823 15.4023 2.9157 24.9529 24.3585 43.6136 32.2712 29.0666 20.5670 21.4645 9.6686 8.2739 10.8588 44.2001 23.7791
temp: 298.150 k
press: 1.00000 atm
elementType: 8 6 6 6 6 6 6 6 6 6 6 6 6 1 1 1 1 1 1 1 1 1 1 1 1 1 1
symmnumber: 1
zpe: 597299.3 jmol-1
zpe.correction: 0.227499 hartree
zpe.thermalcorrener: 0.238797 hartree
zpe.thermalcorrenthalpy: 0.239741 hartree
zpe.thermalcorrgfe: 0.189223 hartree
zpe.sumelectzpe: -539.947342 hartree
zpe.sumelectthermal: -539.936045 hartree
zpe.sumelectthermalent: -539.935100 hartree
zpe.sumelectthermalfe: -539.985618 hartree
dipole: -2.9561 -1.6245 0.4352
dipole: 3.4010
quadrupole: -93.4019 -72.2419 -78.1419
quadrupole: -7.0054 2.0263 -1.3290
quadrupole: -12.1400 9.0200 3.1200 -7.0054 2.0263 -1.3290
hfenergy: -540.1748412 hartree
pointgroup: C01 [X(C12H14O1)]
dipole: -1.1592406 0.4668019 0.4781674 debye
polarizability: 169.9120383|-2.6741805|98.5043684|-2.2033827|14.893367|102.8798425 unknown
InChI: InChI=1S/C12H14O/c13-12-8-6-11(7-9-12)10-4-2-1-3-5-10/h1-5,11H,6-9H2
charge 0 multiplicity 1
27 atoms
O  4.352932 -0.560906 -0.504461
C  0.358001 0.349232 0.386049
C  1.083541 0.894934 -0.876223
C  1.050242 -0.958903 0.86563
C  2.595678 1.138086 -0.616708
C  2.561571 -0.742369 1.152377
C  -1.138428 0.148989 0.150478
C  3.277832 -0.100381 -0.035594
C  -2.092095 0.841541 0.939139
C  -1.613379 -0.73578 -0.854376
C  -3.479306 0.660139 0.734423
C  -2.997573 -0.92054 -1.063134
C  -3.937881 -0.222905 -0.269071
H  0.478343 1.104315 1.192571
H  0.607549 1.836831 -1.206704
H  0.968794 0.171489 -1.707308
H  0.933623 -1.740967 0.089505
H  0.550038 -1.337729 1.776265
H  2.7043 1.962823 0.119229
H  3.12273 1.438632 -1.538549
H  3.066621 -1.690013 1.406973
H  2.665921 -0.059129 2.021774
H  -1.743963 1.528797 1.720724
H  -0.900216 -1.285784 -1.480913
H  -4.198686 1.206146 1.355392
H  -3.344032 -1.6074 -1.843846
H  -5.012058 -0.365948 -0.431141
