program: Gaussian 09
title: 000078575
version: EM64L-G09RevD.01
frameworkgroup: C1[X(C4H2Cl2N2)]
method: RPBEPBE
basis: SDD
operation: Freq
keyword: #p
keyword: freq=noraman
keyword: PBEPBE/SDD
title: #p freq=noraman PBEPBE/SDD
converged: NO NO NO NO
title: Mulliken charges:
elementType: Cl Cl N N C C C C H H
charge: 0.029154 0.029167 0.097559 0.097557 -0.143597 -0.143600 -0.241914 -0.241915 0.258795 0.258795
chargesum: 0.00000
title: Mulliken charges with hydrogens summed into heavy atoms:
elementType: Cl Cl N N C C C C
charge: 0.029154 0.029167 0.097559 0.097557 -0.143597 -0.143600 0.016881 0.016880
polarizability: 1.11923441e+02 5.47864840e-05 7.71039342e+01 -7.80275093e-03 -1.77933265e-03 2.72056488e+01
1716.lowfreq: -0.0020 0.0034 0.0045 11.8151 13.6500 19.3245 91.2183 185.3656 243.8480
frequency: 91.1896 185.3656 243.8479 343.7589 396.5157 435.8940 474.8416 511.5277 611.4179 742.6727 757.3816 856.8099 937.3836 967.7083 1033.5002 1160.2694 1179.7062 1259.4779 1332.6665 1391.4154 1479.6484 1498.7993 3158.6112 3182.8386
redmass: 7.8673 31.0209 5.8387 13.9027 10.7706 14.3341 12.2121 3.8092 11.5379 7.5741 8.7362 1.2175 1.4631 8.9927 3.5503 2.6909 2.9872 11.0368 2.5528 1.6118 4.6152 10.2952 1.0890 1.0998
irintensity: 0.0000 0.0707 3.6829 3.5020 0.5144 28.4750 6.4939 0.0000 0.1894 0.0000 27.2538 39.1161 0.0000 84.0103 16.6115 167.2011 8.4988 0.6680 159.1390 23.1610 3.1853 26.2377 0.0206 21.5132
temp: 298.150 k
press: 1.00000 atm
elementType: 17 17 7 7 6 6 6 6 1 1
symmnumber: 1
zpe: 144947.0 jmol-1
zpe.correction: 0.055207 hartree
zpe.thermalcorrener: 0.061892 hartree
zpe.thermalcorrenthalpy: 0.062836 hartree
zpe.thermalcorrgfe: 0.022952 hartree
zpe.sumelectzpe: -1182.649341 hartree
zpe.sumelectthermal: -1182.642656 hartree
zpe.sumelectthermalent: -1182.641712 hartree
zpe.sumelectthermalfe: -1182.681597 hartree
dipole: -2.9557 0.0000 0.0003
dipole: 2.9557
quadrupole: -48.9438 -66.7933 -59.3638
quadrupole: 0.0003 -0.0011 0.0003
quadrupole: 9.4232 -8.4263 -0.9968 0.0003 -0.0011 0.0003
hfenergy: -1182.7045483 hartree
pointgroup: C01 [X(C4H2Cl2N2)]
dipole: 1.1628425 0.0002198 0.0001195 debye
dipolederiv: -0.6630789 0.3756443 -0.0000573 0.4176292 -0.3091818 0.000036 -0.0000564 0.0000295 -0.0438068 -0.6627367 -0.3757925 -0.0000489 -0.4177739 -0.3095052 -0.000035 -0.0000192 -0.0000111 -0.0437973 -0.4716677 0.2501079 -0.0000365 -0.2905494 -0.2925154 -0.0000319 -0.0000771 0.0000218 -0.1672619 -0.4716757 -0.2501837 0.0000013 0.290468 -0.2925089 0.0000075 0.0000089 -0.0000114 -0.1672645 0.9919858 -0.7720811 0.0001041 -0.8154301 0.4111679 -0.0000721 0.0001034 -0.0000601 0.0857071 0.9912986 0.7723277 0.0000315 0.8156736 0.4118499 0.0000787 0.0000342 0.0000337 0.0857056 0.1765912 -0.0453599 0.0000474 0.427869 0.1178278 0.0000629 0.0000808 0.000006 -0.0271925 0.1767494 0.0453822 0.0000004 -0.4278427 0.1176678 -0.0000338 -0.000028 0. -0.0271913 -0.0337067 -0.0378562 -0.0000287 -0.0887579 0.0725726 -0.0000165 -0.0000336 -0.0000106 0.1525508 -0.0337593 0.0378111 -0.0000133 0.0887142 0.0726253 0.0000042 -0.000013 0.0000024 0.1525507 unknown
polarizability: 111.9234396|0.0069291|77.1039355|0.0078024|0.0017809|27.2056488 unknown
InChI: InChI=1S/C4H2Cl2N2/c5-3-4(6)8-2-1-7-3/h1-2H
charge 0 multiplicity 1
10 atoms
Cl -2.038747 1.657755 -0.000106
Cl -2.038039 -1.658627 -0.000117
N  0.654464 1.404081 0.000205
N  0.655055 -1.403836 0.000039
C  -0.495052 0.712782 0.000028
C  -0.494755 -0.713025 -0.00005
C  1.828817 0.707729 0.000299
C  1.829115 -0.706985 0.000187
H  2.753601 1.291159 0.000487
H  2.754141 -1.290033 0.00023
