program: Gaussian 09
title: 000078712
version: EM64L-G09RevD.01
frameworkgroup: C1[X(C19H23BrN2O2)]
method: RPBEPBE
basis: SDD
operation: Freq
keyword: #p
keyword: freq=noraman
keyword: PBEPBE/SDD
title: #p freq=noraman PBEPBE/SDD
converged: YES YES NO NO
title: Mulliken charges:
elementType: Br O O N N C C C C C C C C C C C C C C C C C C C H H H H H H H H H H H H H H H H H H H H H H H
charge: 0.010916 -0.361039 -0.281424 -0.110746 -0.483322 -0.407838 -0.332388 -0.328280 -0.277916 -0.666635 -0.669630 0.327867 0.042248 -0.336955 -0.225209 0.135797 -0.193938 -0.243816 0.468990 -0.349112 -0.445331 -0.213927 -0.200397 -0.256069 0.210904 0.227083 0.206123 0.198658 0.210218 0.192951 0.235955 0.220476 0.211003 0.224596 0.213012 0.208821 0.228102 0.214439 0.257121 0.301043 0.252584 0.381559 0.310748 0.217274 0.225809 0.222226 0.227450
chargesum: 0.00000
title: Mulliken charges with hydrogens summed into heavy atoms:
elementType: Br O O N N C C C C C C C C C C C C C C C C C C C
charge: 0.010916 -0.361039 -0.281424 -0.110746 -0.101763 0.030149 0.072393 0.074889 0.178515 -0.018023 -0.018270 0.327867 0.042248 -0.079834 0.075835 0.135797 0.058647 -0.243816 0.468990 -0.038364 -0.228057 0.011882 0.021829 -0.028620
polarizability: 3.54583481e+02 3.94867339e+01 3.06776899e+02 -8.83998850e-01 3.44025616e-01 1.32774607e+02
1716.lowfreq: -5.0195 -0.0004 -0.0003 0.0003 1.4325 4.8281 14.8880 19.0988 25.0947
frequency: 14.7461 19.0855 25.0530 31.1783 46.7995 53.0452 60.4292 79.8211 87.0004 91.6970 120.4669 135.0519 142.8328 153.1630 167.2257 174.5278 211.2590 217.2077 239.4142 263.0522 287.1194 289.0395 318.6969 329.0524 345.3213 369.7664 373.2129 407.9463 430.7356 440.3679 457.9470 482.2390 512.4519 533.9041 539.3293 589.6445 615.7180 630.9428 672.5234 673.5322 695.2207 741.4982 752.1406 765.7621 788.5241 795.4523 797.1627 806.7940 816.9424 825.8140 833.3901 850.0263 871.3296 915.8252 918.8074 935.0831 957.3087 962.3535 972.1430 984.0058 992.1706 1002.2075 1024.8820 1064.2357 1065.2738 1070.8285 1075.6717 1078.8015 1085.3748 1090.5796 1093.3293 1123.1494 1144.8961 1162.8373 1171.2268 1184.9194 1202.0370 1208.4295 1219.8907 1237.5117 1260.9951 1277.4719 1282.6915 1289.3953 1293.7025 1319.6724 1330.1638 1363.0114 1367.2876 1373.6711 1379.5514 1387.2236 1388.1702 1389.4969 1390.8850 1436.6700 1455.1477 1462.3357 1463.4047 1470.1882 1474.6325 1481.5408 1485.2318 1485.6888 1488.5113 1491.9585 1541.9699 1564.1994 1584.8425 1597.0725 1615.6578 1628.5358 2864.6526 2871.6187 2897.9338 2982.4222 2984.5666 2987.2863 3020.0172 3040.1070 3045.0596 3067.7364 3075.5082 3081.0313 3092.6876 3093.1630 3107.6685 3130.0798 3141.6046 3160.7093 3163.3915 3165.0273 3180.7700 3195.8972 3357.3639
redmass: 4.3681 3.2971 5.8723 4.5532 4.6693 3.9226 4.1513 2.4458 2.4919 6.1051 3.9529 3.6639 5.1297 3.1770 3.3403 2.0810 2.8276 1.5788 2.6232 4.7396 2.5354 2.2292 3.6167 6.5946 5.5369 4.9662 4.6091 2.9222 3.5255 3.6825 3.0958 2.9706 3.0398 6.3057 3.7403 5.8888 6.4974 7.4282 7.0428 5.5787 1.8623 3.1107 3.9529 1.7232 1.7235 1.1418 1.5233 1.7302 1.2766 1.3313 5.0829 1.2485 7.5663 1.8606 1.4452 1.3640 1.3680 8.5637 1.3469 6.1658 2.2081 1.3077 2.2136 2.5788 1.7622 3.1393 1.8543 2.0684 2.2662 2.1623 2.4089 1.6943 1.6207 1.4149 1.0512 1.1181 3.8250 2.2694 2.7423 1.6326 1.3750 2.1177 1.1430 1.2228 1.2362 1.4398 1.3475 1.3487 1.5489 3.5278 3.4245 1.2786 5.7293 1.5595 1.2968 2.4225 1.8930 1.0775 1.0804 1.0591 1.1414 1.0736 1.1104 2.1985 1.1048 1.0787 2.9863 5.4522 7.7893 6.3858 6.1162 2.4130 1.0720 1.0711 1.0703 1.0360 1.0566 1.0357 1.0882 1.0879 1.0935 1.1050 1.0982 1.0984 1.1005 1.1005 1.0881 1.0868 1.0935 1.0884 1.0998 1.0917 1.0962 1.0949 1.0800
irintensity: 0.5351 0.0309 0.9181 0.0504 1.4678 0.3148 0.1857 0.0598 0.3272 1.0748 0.2161 1.2684 1.5352 0.7642 2.4491 1.8260 4.4414 1.0876 2.4370 1.8001 1.0159 0.7386 0.3837 1.6022 0.1671 8.5013 7.3781 0.0230 4.0543 0.1534 12.4145 4.2190 32.0093 23.6240 3.0193 1.9582 0.0554 50.8765 27.5272 1.8198 36.8930 3.4853 0.0993 39.3970 9.8804 3.8895 11.6597 7.0480 116.5282 3.9960 8.6710 20.4125 15.7039 1.5210 14.3659 3.0819 8.0017 117.1604 0.2937 1.5090 6.2722 3.7489 10.4952 14.2577 35.3995 108.2647 13.7990 15.9998 3.8792 16.0921 8.6496 6.8322 29.3657 6.8135 0.7139 0.0764 155.6203 48.7984 80.1602 17.9283 91.0662 33.9351 4.1697 12.8209 24.6311 33.9483 5.0305 1.2838 10.2878 0.6733 11.6302 20.5040 76.0881 1.4703 25.5692 68.0328 180.8622 15.0686 1.4578 3.0968 10.5476 7.2597 21.3793 82.0576 3.2433 13.3897 397.2233 12.5447 52.1592 76.9154 25.2905 135.6776 33.2981 124.2408 117.7009 25.2099 39.2455 29.4491 22.4635 11.4624 5.1104 39.4857 64.1031 58.0019 21.2163 54.0580 16.2647 0.0945 33.6145 2.8145 34.9320 6.2250 9.2623 8.2229 259.9866
temp: 298.150 k
press: 1.00000 atm
elementType: 35 8 8 7 7 6 6 6 6 6 6 6 6 6 6 6 6 6 6 6 6 6 6 6 1 1 1 1 1 1 1 1 1 1 1 1 1 1 1 1 1 1 1 1 1 1 1
symmnumber: 1
zpe: 1001535.5 jmol-1
zpe.correction: 0.381465 hartree
zpe.thermalcorrener: 0.406009 hartree
zpe.thermalcorrenthalpy: 0.406953 hartree
zpe.thermalcorrgfe: 0.322516 hartree
zpe.sumelectzpe: -1009.449656 hartree
zpe.sumelectthermal: -1009.425112 hartree
zpe.sumelectthermalent: -1009.424168 hartree
zpe.sumelectthermalfe: -1009.508604 hartree
dipole: 6.5506 -4.5999 -0.2462
dipole: 8.0082
quadrupole: -148.0575 -147.6561 -156.6276
quadrupole: 1.1351 -0.6755 1.2346
quadrupole: 2.7229 3.1243 -5.8472 1.1351 -0.6755 1.2346
hfenergy: -1009.8311209 hartree
pointgroup: C01 [X(C19H23Br1N2O2)]
dipole: -2.1322782 2.3191746 0.0377656 debye
polarizability: 367.7213852|24.4157894|290.4706187|17.5951322|18.7973408|135.9429837 unknown
InChI: InChI=1S/C19H23BrN2O2/c1-3-22(4-2)12-13-24-18-11-10-15(20)14-17(18)19(23)21-16-8-6-5-7-9-16/h5-11,14,21H,3-4,12-13H2,1-2H3
charge 0 multiplicity 1
47 atoms
Br 6.426634 0.061552 0.410888
O  0.293184 0.777895 0.120096
O  2.11401 -3.067441 -0.258833
N  -2.498115 3.255626 0.16997
N  0.103854 -1.853061 -0.261878
C  -1.841939 1.9287 0.173312
C  -2.661493 3.815919 -1.201058
C  -3.737382 3.316041 0.991342
C  -0.320118 2.117752 0.259146
C  -2.707208 5.355222 -1.224491
C  -3.455623 3.297543 2.505379
C  1.693438 0.645157 0.189767
C  2.244266 -0.66785 0.051412
C  2.539491 1.762392 0.389075
C  3.653404 -0.809893 0.12186
C  1.484231 -1.964927 -0.168083
C  3.938796 1.598063 0.454971
C  4.481373 0.304867 0.319877
C  -0.849588 -2.884441 -0.468629
C  -0.510178 -4.25861 -0.607897
C  -2.21648 -2.491276 -0.535781
C  -1.53566 -5.207658 -0.809608
C  -3.227046 -3.451279 -0.73769
C  -2.893419 -4.819634 -0.876171
H  -2.089097 1.326101 -0.733062
H  -2.176944 1.347038 1.050256
H  -1.797923 3.480574 -1.806324
H  -3.572999 3.400913 -1.699795
H  -4.254398 4.259969 0.742613
H  -4.443069 2.489132 0.725716
H  -0.045445 2.559402 1.234944
H  0.044854 2.772884 -0.555761
H  -3.570024 5.752936 -0.660577
H  -1.788094 5.771637 -0.77681
H  -2.792971 5.72066 -2.264578
H  -2.958349 2.363115 2.824763
H  -2.802745 4.143786 2.781229
H  -4.400872 3.379278 3.073181
H  2.12331 2.767189 0.495813
H  4.049533 -1.824328 0.014555
H  4.586409 2.465624 0.609481
H  -0.259383 -0.892511 -0.165194
H  0.538414 -4.555998 -0.556684
H  -2.481497 -1.430962 -0.42969
H  -1.264981 -6.264336 -0.915749
H  -4.274251 -3.132116 -0.7873
H  -3.678109 -5.567445 -1.033002
