program: Gaussian 09
title: 000078600
version: EM64L-G09RevD.01
frameworkgroup: C1[X(C14H9ClO)]
method: RPBEPBE
basis: SDD
operation: Freq
keyword: #p
keyword: freq=noraman
keyword: PBEPBE/SDD
title: #p freq=noraman PBEPBE/SDD
converged: NO YES NO NO
title: Mulliken charges:
elementType: Cl O C C C C C C C C C C C C C C H H H H H H H H H
charge: -0.054455 -0.227605 -0.698270 0.477365 0.416419 0.122681 0.084217 -0.082095 -0.305051 -0.386191 -0.375728 -0.356329 -0.248504 -0.228780 -0.226770 -0.239078 0.266948 0.266954 0.243858 0.291141 0.286047 0.260336 0.233272 0.242019 0.237597
chargesum: 0.00000
title: Mulliken charges with hydrogens summed into heavy atoms:
elementType: Cl O C C C C C C C C C C C C C C
charge: -0.054455 -0.227605 -0.164368 0.477365 0.416419 0.122681 0.084217 -0.082095 -0.305051 -0.142333 -0.084587 -0.070282 0.011832 0.004492 0.015249 -0.001480
polarizability: 2.30513393e+02 -7.69484915e+00 1.89487851e+02 7.29709852e-04 -1.09465976e-03 6.33601234e+01
1716.lowfreq: -0.0015 -0.0012 -0.0007 7.3660 13.5528 15.0920 48.7441 75.9123 132.0287
frequency: 48.7222 75.7147 132.0275 149.9155 191.2438 220.9754 242.9519 266.7484 332.6537 349.2308 384.8714 416.3413 447.9787 455.0576 499.7025 507.5257 526.9967 585.1214 629.1760 661.4830 666.1397 719.3780 741.1371 742.3914 790.3462 828.2994 830.5320 846.9383 882.1799 930.2735 931.8009 952.3043 982.3538 1000.3460 1008.5086 1034.9356 1064.9481 1097.0844 1117.2220 1170.6881 1173.6408 1184.8741 1201.2029 1202.8182 1215.4312 1253.1974 1304.1467 1328.3840 1383.1599 1395.5227 1419.1246 1430.6216 1449.0361 1451.6281 1480.3756 1542.5478 1564.6571 1593.2397 1606.6915 1620.3288 2962.5720 2995.1281 3119.8815 3137.9213 3145.5782 3152.0003 3163.8738 3167.2784 3175.7296
redmass: 5.0149 5.3660 4.9008 10.4514 4.2599 2.5126 4.8983 6.0920 7.6321 9.5172 7.8203 3.6299 8.5729 2.9195 3.6838 4.2976 8.0338 5.6260 6.4225 6.5303 3.7772 3.0263 7.2373 1.6108 1.4410 2.2092 5.3006 4.5313 1.3823 7.1489 1.4233 2.2714 1.4093 1.3479 1.3448 2.1963 1.9838 2.1940 3.8251 1.4057 1.1217 1.4524 2.4620 1.0946 1.8447 1.5890 3.1862 2.0531 5.9687 7.8494 1.2855 2.6152 2.3432 2.8120 2.5142 10.0359 6.9773 7.2515 7.2780 6.9542 1.0613 1.0958 1.0876 1.0894 1.0872 1.0935 1.0927 1.1001 1.0992
irintensity: 1.8683 1.2358 2.1896 2.0747 0.1377 7.8502 1.5132 2.4977 11.1840 0.6675 6.8516 0.0142 1.8681 10.2927 0.0007 1.5121 0.2094 2.2883 5.2372 12.6587 0.1676 21.3871 32.7687 87.4171 2.4597 45.2784 7.6922 4.8492 2.7306 37.5660 2.0009 2.3330 3.9161 2.0946 0.4133 3.0941 15.2770 18.2955 45.3349 9.9872 2.7286 0.1153 3.1555 0.0688 3.6966 1.0737 268.7578 7.8490 1.8843 5.5318 21.7055 16.3822 16.2388 27.4793 3.1626 186.1954 0.1624 19.2045 33.2491 15.0851 1.4041 3.4074 4.1770 11.5017 5.4262 8.8156 2.2986 29.8304 12.0865
temp: 298.150 k
press: 1.00000 atm
elementType: 17 8 6 6 6 6 6 6 6 6 6 6 6 6 6 6 1 1 1 1 1 1 1 1 1
symmnumber: 1
zpe: 486179.3 jmol-1
zpe.correction: 0.185176 hartree
zpe.thermalcorrener: 0.197322 hartree
zpe.thermalcorrenthalpy: 0.198266 hartree
zpe.thermalcorrgfe: 0.146239 hartree
zpe.sumelectzpe: -1073.113230 hartree
zpe.sumelectthermal: -1073.101085 hartree
zpe.sumelectthermalent: -1073.100141 hartree
zpe.sumelectthermalfe: -1073.152167 hartree
dipole: -0.1522 -2.3145 -0.0009
dipole: 2.3195
quadrupole: -84.1433 -100.1712 -102.6672
quadrupole: -12.6239 -0.0019 -0.0060
quadrupole: 11.5173 -4.5107 -7.0066 -12.6239 -0.0019 -0.0060
hfenergy: -1073.2984062 hartree
pointgroup: C01 [X(C14H9Cl1O1)]
dipole: -0.0838093 0.9087013 -0.0001944 debye
dipolederiv: -0.1951262 -0.1227488 -0.0000253 -0.2418447 -0.7410826 -0.0001854 -0.0000611 -0.0002261 -0.0706533 -0.738706 -0.0727375 -0.0000274 -0.0129393 -1.0404463 -0.0001373 0.0000279 0.000239 -0.3282065 0.0274091 0.0122613 -0.0000158 -0.0170674 -0.1813798 -0.0002158 -0.0000317 -0.0004876 0.1229954 0.1338324 -0.2309591 -0.0001622 -0.0989604 -0.1130772 0.0000463 -0.0003392 0.0000842 0.0266539 0.3102811 0.1675226 0.0002107 -0.1155333 0.1277901 0.000096 0.0003991 0.0001202 -0.0001603 -0.6928087 -0.2557797 0.0000056 -0.1484261 -0.106774 0.0000218 -0.0000927 -0.0000228 -0.0042726 -0.6384833 0.2792176 -0.0000424 0.3076738 -0.3174015 0.0000031 0.00005 -0.0000491 -0.0122069 1.8148413 -0.0159623 0.0000129 -0.1361295 1.0861189 -0.0000212 -0.0000111 -0.0001104 0.1473511 -0.020802 0.3086918 0.0001006 0.4420563 1.0942081 0.0003508 0.0001333 0.0004054 -0.0897039 -0.3610448 -0.0411108 -0.0000461 0.0055131 0.1469847 0.0000886 -0.0000198 0.0000865 -0.1732555 0.0282616 0.1421447 0.0000401 -0.1014564 0.0247162 0.0000515 -0.0000172 0.0000132 -0.109183 0.0944578 -0.1502769 -0.0000114 0.1104455 0.0766572 0.0000684 0.0000189 0.0000287 -0.1000957 -0.0275494 -0.0162981 -0.0000184 -0.010961 -0.1600655 -0.0000314 -0.0000043 -0.0000439 -0.0883454 0.0804532 -0.0205187 0.0000347 -0.0656472 0.1334893 0.0000332 0.000018 0.0000259 -0.1283887 0.0340926 -0.1211061 -0.000036 -0.1763408 -0.0288858 0.0000262 -0.000047 0.0000239 -0.1594538 0.0684417 0.1506289 0.0000505 0.1882962 -0.1843788 0.0000031 0.0000483 0.0000009 -0.1680143 -0.0173973 0.004906 0.0135405 0.0249447 0.0526592 0.0764364 0.0145231 0.0822123 0.0173873 -0.0175845 0.004917 -0.0135538 0.0249781 0.0528783 -0.0763786 -0.0145215 -0.0820968 0.0171061 0.0829793 -0.0597454 -0.0000211 -0.0039983 -0.098775 -0.0000539 -0.0000417 -0.0000558 0.1492587 0.1454137 -0.0528444 -0.000016 0.0204882 0.011209 -0.0000528 -0.0000474 -0.0000295 0.1584035 0.1355835 0.0195308 0.0000022 -0.0588934 -0.0012066 -0.000053 0.0000373 -0.0000422 0.1541807 -0.021848 -0.047339 0.0000013 -0.0627277 0.0825145 -0.0000156 -0.0000165 -0.0000205 0.1613785 -0.0591883 0.0985306 -0.0000117 0.109225 0.0195678 -0.0000099 0.0000025 -0.0000058 0.1548658 -0.0538947 0.082916 0.0000338 0.0907538 0.0055648 -0.0000438 0.0000487 -0.0000299 0.1613055 -0.111614 -0.0638405 -0.0000454 -0.0734491 0.059115 -0.0000267 -0.0000557 -0.0000198 0.1610537 unknown
polarizability: 231.8883644|-0.9545805|188.1128746|0.003596|0.0258719|63.3601289 unknown
InChI: InChI=1S/C14H9ClO/c15-13-7-3-6-11-12(13)8-9-4-1-2-5-10(9)14(11)16/h1-7H,8H2
charge 0 multiplicity 1
25 atoms
Cl 2.839291 2.827481 0.00068
O  -0.516455 -2.726397 0.000141
C  0.031499 1.512525 0.000689
C  1.199323 0.551294 0.000093
C  -1.345427 0.878369 0.000099
C  1.013535 -0.862115 -0.000281
C  -1.525008 -0.532838 -0.000232
C  -0.359644 -1.462399 -0.000542
C  2.534656 1.021603 0.000121
C  -2.491704 1.712406 0.000106
C  2.128953 -1.741492 -0.000545
C  -2.835927 -1.085459 -0.00046
C  3.650447 0.167662 -0.000178
C  -3.788355 1.160335 -0.00016
C  3.438634 -1.233033 -0.000504
C  -3.963577 -0.248199 -0.000436
H  0.124962 2.190865 -0.872784
H  0.124786 2.189259 0.875457
H  -2.362941 2.801786 0.000338
H  1.92599 -2.816814 -0.000813
H  -2.927241 -2.176566 -0.00072
H  4.6612 0.586155 -0.000131
H  -4.662216 1.821495 -0.000157
H  4.299979 -1.908596 -0.000727
H  -4.971259 -0.676928 -0.000654
