program: Gaussian 09
title: 000078601
version: EM64L-G09RevD.01
frameworkgroup: C1[X(C14H9ClO)]
method: RPBEPBE
basis: SDD
operation: Freq
keyword: #p
keyword: freq=noraman
keyword: PBEPBE/SDD
title: #p freq=noraman PBEPBE/SDD
converged: NO YES NO NO
title: Mulliken charges:
elementType: Cl O C C C C C C C C C C C C C C H H H H H H H H H
charge: -0.047187 -0.230059 -0.724373 0.405617 0.392565 0.104052 0.099382 -0.068050 -0.345719 -0.384114 -0.350662 -0.356155 -0.112193 -0.229546 -0.235368 -0.238633 0.251494 0.251652 0.265230 0.240723 0.290800 0.286160 0.263659 0.233210 0.237516
chargesum: 0.00000
title: Mulliken charges with hydrogens summed into heavy atoms:
elementType: Cl O C C C C C C C C C C C C C C
charge: -0.047187 -0.230059 -0.221226 0.405617 0.392565 0.104052 0.099382 -0.068050 -0.080489 -0.143391 -0.059862 -0.069995 -0.112193 0.003663 0.028291 -0.001117
polarizability: 2.63097395e+02 2.11991577e-03 1.69652375e+02 -2.88639532e-02 -2.15467045e-02 6.32794892e+01
1716.lowfreq: -12.8502 -11.7374 -0.0022 -0.0011 -0.0006 5.4774 34.5161 83.6250 121.6482
frequency: 34.2522 83.6250 121.6476 149.6519 174.3843 208.4921 261.6205 277.0338 288.9954 347.0960 402.3356 415.1624 443.0813 464.0923 475.8188 532.0112 535.6825 568.5933 643.4058 660.3833 660.8028 702.4683 723.7834 743.2327 804.1799 831.8322 850.7189 868.5407 868.7433 892.1235 917.3875 960.6716 981.7593 992.0755 1008.0275 1034.8847 1074.3395 1095.4216 1106.9086 1166.9528 1173.3594 1196.4433 1200.2415 1205.4132 1218.9016 1265.4211 1303.7191 1324.7169 1388.7156 1393.9168 1406.1674 1425.4157 1446.6831 1467.2083 1479.1174 1544.0896 1569.2271 1592.3645 1605.6374 1620.3621 2957.8958 2994.9294 3118.8734 3138.3884 3148.7383 3153.1237 3155.5375 3168.0645 3177.8967
redmass: 4.5134 6.5044 5.0605 9.0097 3.3182 2.9732 7.0037 6.0538 9.7890 6.9797 6.6178 3.1961 3.0241 3.1248 8.9673 4.2267 7.9950 5.4687 6.8449 6.1026 3.9812 6.2024 3.5738 1.5995 1.8448 5.3380 1.5451 4.6080 1.4337 1.3949 7.0819 2.2715 1.4496 1.3532 1.3464 2.1791 2.1607 2.1595 2.1885 1.9230 1.1020 2.9489 1.0987 1.4621 1.7484 1.3914 2.5488 2.2190 8.1149 8.3488 3.4255 1.1504 2.7930 2.6374 2.4604 10.8718 7.2794 7.2050 7.1923 6.9450 1.0607 1.0972 1.0879 1.0890 1.0925 1.0935 1.0890 1.1001 1.0969
irintensity: 0.0011 1.7740 1.6835 1.1659 4.0771 4.7053 3.7776 0.1339 3.2244 11.7732 6.2290 6.0879 0.7728 4.2542 8.9823 3.3775 9.5848 1.1870 3.1827 3.7749 12.8662 9.2836 3.9100 80.4928 1.5630 5.5675 32.2497 16.6351 8.4722 11.7982 79.1962 6.7983 5.9365 1.8942 0.3496 5.0565 33.7554 12.0931 8.0110 14.2000 1.6911 21.3171 0.0174 5.8717 4.7940 1.7804 226.2179 83.2966 2.1148 4.4823 3.7946 22.6429 32.3748 14.6749 0.3852 134.2383 43.7689 80.0385 125.5017 7.1478 6.5167 5.6753 5.8380 11.2391 1.7873 9.2268 1.2813 31.4926 3.7077
temp: 298.150 k
press: 1.00000 atm
elementType: 17 8 6 6 6 6 6 6 6 6 6 6 6 6 6 6 1 1 1 1 1 1 1 1 1
symmnumber: 1
zpe: 485760.3 jmol-1
zpe.correction: 0.185016 hartree
zpe.thermalcorrener: 0.197249 hartree
zpe.thermalcorrenthalpy: 0.198194 hartree
zpe.thermalcorrgfe: 0.145678 hartree
zpe.sumelectzpe: -1073.112918 hartree
zpe.sumelectthermal: -1073.100685 hartree
zpe.sumelectthermalent: -1073.099741 hartree
zpe.sumelectthermalfe: -1073.152257 hartree
dipole: 1.4914 -3.5621 0.0068
dipole: 3.8617
quadrupole: -93.1765 -96.1686 -102.6357
quadrupole: -9.0777 -0.0100 0.0097
quadrupole: 4.1504 1.1584 -5.3088 -9.0777 -0.0100 0.0097
hfenergy: -1073.2979346 hartree
pointgroup: C01 [X(C14H9Cl1O1)]
dipole: -0.6723282 1.362447 0.0027789 debye
dipolederiv: -0.9098136 -0.2507606 0.0008303 -0.3529134 -0.2340111 0.0003374 0.001158 0.0002905 -0.0655403 -0.7604613 -0.0375945 0.0001752 -0.0697047 -1.0386307 0.0017934 -0.0003972 -0.002545 -0.3321022 -0.0071319 -0.0134406 0.0000049 -0.0198479 -0.1506869 -0.0000114 0.0000271 -0.0009979 0.134776 0.3531207 -0.1590117 -0.0004016 0.1280496 0.2064646 -0.0003897 0.0006408 0.0008593 0.001203 0.2687487 0.1637091 0.0002929 -0.0833379 0.1157015 -0.000416 -0.0006996 0.0010115 -0.006031 -0.8380697 -0.2160437 -0.0000353 -0.1906481 -0.2466204 -0.0002502 0.0014009 -0.0002027 -0.0184567 -0.6603204 0.2670222 0.0000157 0.3008404 -0.2950523 -0.0002158 -0.001311 0.0000982 -0.0101057 1.9240685 -0.0277024 -0.0000703 -0.0262718 1.1010048 -0.0008675 0.000264 0.001322 0.1518772 -0.640126 0.045221 0.0005624 0.0122075 0.0081536 0.0000383 0.0009665 -0.0000238 -0.1364943 -0.3462853 -0.0486577 -0.0001962 -0.0203737 0.1509973 0.0000184 -0.000438 -0.0001207 -0.174901 0.2599285 0.1554661 -0.000384 -0.1601217 0.0609485 -0.0000318 -0.0003121 -0.0000944 -0.0890567 0.1028009 -0.1418146 0.0002247 0.1163943 0.0718043 -0.000118 0.0001101 -0.0001166 -0.1002043 1.2839604 0.3525434 -0.0015807 0.5207998 0.4361181 -0.00041 -0.0017036 -0.0003956 -0.0458067 0.0678779 -0.0234703 0.0004864 -0.0732775 0.1219316 -0.0001059 0.0002957 -0.0001171 -0.1299353 -0.3328106 -0.2457941 0.0000063 -0.332187 -0.2066115 0.0003689 0.0001807 0.0004709 -0.1252529 0.0527095 0.1558043 0.0005004 0.2079879 -0.1675004 0.0002225 0.0005069 0.0003964 -0.1674522 -0.0364575 0.0018884 0.010239 0.0017902 0.0313374 0.0851686 0.0120542 0.1043127 0.0081277 -0.0361102 0.0019192 -0.0102483 0.0018359 0.0318408 -0.0851306 -0.0120661 -0.1042334 0.0077391 0.0947989 0.0088087 0.0000599 -0.0230192 -0.0427105 0.0000031 -0.0002351 0.0001293 0.1574438 0.0838051 -0.0535086 -0.0000736 0.0049543 -0.1090434 0.0000226 0.0002181 0.0001082 0.1495578 0.1296063 -0.0507923 0.0000981 0.0281073 0.0147395 0.0000202 0.0002654 0.0000353 0.1533876 0.1418975 0.0218688 -0.0000815 -0.0551313 -0.0011217 0.0000381 -0.0002707 0.0000803 0.1538939 -0.0180268 0.0655629 0.0002238 0.0553575 0.0605732 -0.0001234 0.0001777 -0.0002142 0.1674425 -0.0685989 0.0973624 -0.0002984 0.1076557 0.0264047 0.0001706 -0.0004563 0.0001627 0.1550991 -0.1091106 -0.0685852 -0.0003501 -0.079146 0.0539691 -0.0001316 -0.0003764 -0.0002157 0.1607914 unknown
polarizability: 262.7395136|5.7718668|170.0102608|-0.0170881|0.0175453|63.2794852 unknown
InChI: InChI=1S/C14H9ClO/c15-11-5-6-13-10(8-11)7-9-3-1-2-4-12(9)14(13)16/h1-6,8H,7H2
charge 0 multiplicity 1
25 atoms
Cl 5.113648 1.152716 -0.003575
O  -0.579477 -2.631623 -0.001759
C  -0.173105 1.624002 0.003039
C  1.028943 0.699284 0.001988
C  -1.530399 0.945313 0.001754
C  0.883809 -0.715892 0.002034
C  -1.659629 -0.471778 0.001807
C  -0.462119 -1.36311 0.005063
C  2.330487 1.260642 0.000456
C  -2.704999 1.738793 -0.00004
C  2.037688 -1.546788 0.000075
C  -2.950691 -1.068628 -0.00037
C  3.449194 0.412827 -0.001324
C  -3.981656 1.142189 -0.002061
C  3.328856 -0.995043 -0.001593
C  -4.106866 -0.271202 -0.002245
H  -0.107401 2.298803 -0.875792
H  -0.107745 2.296859 0.883406
H  2.464506 2.347441 0.000374
H  -2.615227 2.832144 -0.00013
H  1.885706 -2.63083 0.000344
H  -3.004441 -2.162175 -0.00008
H  4.219651 -1.628732 -0.002949
H  -4.878107 1.772144 -0.003583
H  -5.098828 -0.734957 -0.003741
