program: Gaussian 09
title: 000078597
version: EM64L-G09RevD.01
frameworkgroup: C1[X(C9H11NO3)]
method: RPBEPBE
basis: SDD
operation: Freq
keyword: #p
keyword: freq=noraman
keyword: PBEPBE/SDD
title: #p freq=noraman PBEPBE/SDD
converged: YES YES NO NO
title: Mulliken charges:
elementType: O O O N C C C C C C C C C H H H H H H H H H H H
charge: -0.193861 -0.194050 -0.435504 -0.215097 0.142757 0.141467 -0.494736 -0.493814 -0.414344 -0.414489 0.114845 0.114736 -0.301276 0.248438 0.238068 0.250532 0.235114 0.211642 0.217454 0.214096 0.216752 0.229144 0.229211 0.352912
chargesum: 0.00000
title: Mulliken charges with hydrogens summed into heavy atoms:
elementType: O O O N C C C C C C C C C
charge: -0.193861 -0.194050 -0.082592 -0.215097 0.142757 0.141467 -0.008230 -0.008168 0.014753 0.016359 0.114845 0.114736 0.157079
polarizability: 1.29833790e+02 5.26698999e-03 1.28604685e+02 1.62646528e+00 1.41019815e+00 7.05979254e+01
1716.lowfreq: -71.1322 -11.1668 -6.5068 -0.0004 0.0005 0.0006 8.6242 62.2916 106.6722
frequency: -71.1279 62.2699 106.6714 113.9761 127.8759 150.6002 211.1197 248.7284 256.0031 275.4527 317.7113 383.4415 439.4309 453.2530 504.0182 539.9532 594.5109 633.1174 704.5440 731.4952 740.2771 818.4476 833.8534 851.5910 896.6573 923.7339 926.8672 945.9968 968.6880 1076.2663 1078.6687 1086.7808 1123.8117 1135.8219 1141.1944 1175.0093 1222.5090 1230.1761 1230.4062 1267.2568 1303.5635 1331.0430 1338.1970 1352.3244 1368.4408 1387.4826 1422.5254 1446.7365 1451.6333 1452.3083 1469.9775 1471.7846 1628.4847 1666.5408 1679.0422 2973.3231 2973.5373 2985.2413 2986.8046 2990.2791 3031.0046 3032.9641 3045.4073 3053.4706 3060.1240 3565.8583
redmass: 1.2193 4.2990 3.1467 3.2430 3.7531 11.0150 3.9155 3.1217 2.7372 1.9083 6.4868 4.6448 3.6136 2.8530 6.7208 3.0431 6.1646 5.5622 3.8950 6.0567 4.6851 1.8536 2.4490 2.5717 1.5478 3.4683 2.8179 8.1696 2.6227 3.7772 1.9537 2.0833 1.1518 1.9267 1.4621 1.3497 2.2379 1.5633 1.3579 1.2722 1.3126 1.3474 1.4817 1.6695 8.7402 3.2687 1.2402 1.1090 1.0933 1.0771 1.0910 1.0884 12.6428 8.3612 11.6302 1.0651 1.0651 1.0540 1.0657 1.0612 1.0932 1.0941 1.1103 1.0982 1.1040 1.0661
irintensity: 81.1514 4.7211 30.1740 9.0396 36.1386 1.6158 1.8742 2.9717 0.4322 1.3390 11.4566 0.6079 0.6714 3.5165 17.4454 2.2937 39.0614 1.6711 8.5949 9.7246 0.3434 2.5647 5.4230 2.5775 0.8552 2.2149 45.7914 122.3583 4.9380 4.4308 0.4826 3.2235 0.8171 10.8610 25.6248 42.3574 26.3991 7.5700 3.5654 8.1682 6.5562 0.3656 3.3276 6.2669 396.1709 2.7604 1.9919 2.6064 25.2496 35.0999 11.7644 8.0032 488.7606 34.8908 9.2575 16.4618 3.8758 55.2890 25.7917 30.8822 25.6157 3.4783 10.6533 51.7775 49.3710 5.9058
temp: 298.150 k
press: 1.00000 atm
elementType: 8 8 8 7 6 6 6 6 6 6 6 6 6 1 1 1 1 1 1 1 1 1 1 1
symmnumber: 1
zpe: 496428.0 jmol-1
zpe.correction: 0.189079 hartree
zpe.thermalcorrener: 0.200497 hartree
zpe.thermalcorrenthalpy: 0.201441 hartree
zpe.thermalcorrgfe: 0.151538 hartree
zpe.sumelectzpe: -629.015996 hartree
zpe.sumelectthermal: -629.004579 hartree
zpe.sumelectthermalent: -629.003634 hartree
zpe.sumelectthermalfe: -629.053538 hartree
dipole: 1.7948 0.0193 -0.9128
dipole: 2.0136
quadrupole: -55.1819 -89.3738 -76.0782
quadrupole: -0.1138 3.1489 -0.3364
quadrupole: 18.3627 -15.8292 -2.5335 -0.1138 3.1489 -0.3364
hfenergy: -629.2050759 hartree
pointgroup: C01 [X(C9H11N1O3)]
dipole: 0.708297 0.0077469 -0.3547857 debye
dipolederiv: -0.5347008 0.2762162 -0.0155582 0.0040509 -1.0228883 0.0102373 -0.0310571 0.0288869 -0.3212754 -0.5348863 -0.2755831 -0.0334795 -0.0021667 -1.0173298 -0.0516723 -0.0336792 -0.0716541 -0.3266006 -0.4216863 -0.0052876 0.2226892 -0.0120626 -0.5076342 0.0056497 0.4818802 0.0052723 -0.6854111 -1.509048 -0.0006036 0.0314547 0.0046537 -0.9952701 -0.0171688 -0.18109 -0.0216405 -0.2642488 -0.1779709 0.4431356 0.0324768 0.5224764 0.0016667 0.048301 0.0650241 0.0869658 -0.0565354 -0.1613416 -0.4456056 -0.0310563 -0.5217323 0.0084297 -0.0466535 -0.0717404 -0.0479235 -0.0770375 -0.0524182 -0.0297694 -0.0215573 -0.0709816 -0.0748075 -0.0149733 -0.0740549 -0.0594198 0.1316298 -0.064676 0.0406899 -0.0232368 0.0687266 -0.0741148 0.0055564 0.0261537 -0.0527982 0.1437799 0.1127773 0.0156745 0.0150106 -0.0341703 0.0198728 0.0215912 -0.012579 0.0329072 0.1362406 0.1158341 -0.0241075 -0.0209711 0.0291774 0.0218401 0.0242599 0.0082319 0.0273147 0.1285019 1.0508487 -0.2181741 0.0405115 0.2536982 1.4214105 -0.0030183 0.0868902 -0.0054186 0.2592692 1.0500921 0.2141101 0.0614426 -0.2590471 1.415344 0.0794891 0.0670819 0.0858534 0.2645521 1.2021402 0.0062985 -0.25236 0.0103031 0.3235388 -0.011216 -0.3690488 -0.0110087 0.7493899 0.0349297 0.0089689 -0.0212463 0.0138414 -0.0224221 0.0863645 0.0130288 0.12204 0.0334939 0.0146788 -0.0437459 -0.0025817 0.0003541 0.0683348 -0.0551679 0.0037676 -0.0936109 -0.0735989 0.0325831 -0.035524 0.0217437 -0.0329753 -0.0221376 0.0782585 -0.0125047 0.1139992 0.039112 0.0101518 0.0640707 0.0251354 0.0141201 0.0670075 -0.0543299 0.0176894 -0.082841 -0.0747038 0.0685292 0.0188174 0.0040077 0.0524805 0.0414037 -0.0375355 0.0641254 -0.0029831 -0.165283 -0.1441577 -0.1051142 -0.0450721 -0.1147228 -0.0072418 -0.0259144 -0.076593 -0.038199 0.065999 0.0719637 -0.017739 0.0507088 -0.042689 0.0426341 -0.0470683 -0.0066369 -0.0070306 -0.1627037 -0.1594806 0.1126172 -0.0055117 0.1186336 -0.009456 0.0010888 0.0224205 -0.0128902 0.0824966 0.0084158 -0.0107278 0.0068867 -0.1096158 -0.0214657 -0.1203786 0.0398081 -0.0595123 -0.060727 0.0078682 0.0109995 0.0063257 0.1069074 -0.0313062 0.122075 0.0455505 0.061439 -0.0507802 -0.0204462 0.0003832 -0.0457623 0.0007402 0.3745915 0.0022253 -0.0726682 0.0022518 0.2844407 unknown
polarizability: 129.8116848|-0.0009776|128.606948|1.9877147|1.3640819|70.6177667 unknown
InChI: InChI=1S/C9H11NO3/c11-5-10-8(12)6-3-1-2-4-7(6)9(10)13/h11H,1-5H2
charge 0 multiplicity 1
24 atoms
O  -1.13093 2.363114 -0.24608
O  -1.135435 -2.338636 -0.379656
O  -3.430744 -0.02404 1.032088
N  -1.525697 0.013393 -0.342195
C  0.699083 0.6876 -0.054502
C  0.698109 -0.679913 -0.099022
C  1.925685 1.54006 0.099664
C  1.921109 -1.542421 0.020968
C  3.199002 0.684229 -0.142633
C  3.109143 -0.698651 0.556578
C  -0.71199 1.181509 -0.208313
C  -0.713736 -1.161632 -0.279176
C  -2.965948 0.014203 -0.365794
H  1.882249 2.402221 -0.592645
H  1.940538 1.978434 1.118773
H  1.714636 -2.408159 0.678337
H  2.167647 -1.973785 -0.971047
H  3.331486 0.530124 -1.232026
H  4.089212 1.23238 0.216374
H  2.983159 -0.544678 1.646537
H  4.054072 -1.254648 0.415753
H  -3.299775 -0.88586 -0.917759
H  -3.300553 0.942658 -0.867935
H  -4.421923 -0.027101 1.046812
