program: Gaussian 09
title: 000078584
version: EM64L-G09RevD.01
frameworkgroup: C1[X(C8H7F3N2S)]
method: RPBEPBE
basis: SDD
operation: Freq
keyword: #p
keyword: freq=noraman
keyword: PBEPBE/SDD
title: #p freq=noraman PBEPBE/SDD
converged: YES YES NO NO
title: Mulliken charges:
elementType: S F F F N N C C C C C C C C H H H H H H H
charge: 0.280755 -0.181091 -0.153469 -0.162488 0.028419 0.031266 -0.507446 -0.610793 0.211651 -0.335677 0.260196 -0.260803 -0.277524 -0.169594 0.249712 0.260776 0.289091 0.298187 0.252561 0.255986 0.240286
chargesum: 0.00000
title: Mulliken charges with hydrogens summed into heavy atoms:
elementType: S F F F N N C C C C C C C C
charge: 0.280755 -0.181091 -0.153469 -0.162488 0.028419 0.031266 0.003042 -0.023514 0.211651 -0.335677 0.260196 -0.008242 -0.021538 0.070692
polarizability: 1.76883675e+02 6.11385972e+00 1.11357528e+02 1.42393767e+01 -4.63275034e+00 7.00046997e+01
1716.lowfreq: -7.2732 0.0010 0.0015 0.0017 2.3184 8.4746 15.2154 27.6062 39.8762
frequency: 15.0995 27.5172 39.7581 77.0757 101.3489 141.5322 148.3286 178.0333 222.5923 298.6528 313.3833 332.1601 396.4174 405.4681 452.7004 467.5171 478.1248 502.2209 569.4518 610.4414 635.1027 691.2619 725.3196 779.5691 801.2122 879.3427 930.9185 934.9463 958.1931 979.1227 988.3284 1050.3185 1056.6177 1074.0858 1143.0215 1168.6574 1172.4239 1209.9791 1218.9623 1224.2751 1247.1919 1297.9057 1342.9558 1375.8985 1391.9573 1438.4928 1445.0704 1511.5567 1535.9844 1772.4801 2988.1036 3056.7514 3069.3925 3135.4304 3140.0232 3144.3185 3187.3204
redmass: 8.8418 12.9852 7.4144 8.4330 7.2673 9.1314 6.8716 4.1820 3.9611 5.9628 7.8052 3.7205 4.1351 7.1303 7.8693 3.0077 9.5802 8.4410 5.6029 7.3686 5.1284 4.3089 7.9724 7.6449 1.2060 2.0883 5.3646 2.2149 1.3784 1.4473 3.9763 2.8921 2.4304 1.7077 1.4505 6.9066 6.0831 1.4646 2.9477 1.9532 2.9526 1.2447 1.5327 1.9532 1.5307 1.0847 1.0911 5.4131 4.5752 10.7288 1.0649 1.0626 1.0911 1.1083 1.0904 1.0927 1.0993
irintensity: 0.9946 0.1107 0.1340 2.2056 1.1599 1.2415 3.3904 0.5128 6.2661 2.9763 8.7544 1.1419 0.0197 2.6643 10.0502 3.4522 1.0238 5.5125 4.1065 6.2933 2.3021 3.9414 23.8759 3.2546 49.9255 30.9363 22.8032 8.7221 0.0169 0.0614 56.1887 1.6947 57.0271 8.2180 38.3652 213.4143 150.9892 6.6584 10.7549 15.3269 4.0575 29.8062 2.0966 258.0079 1.4608 10.9606 28.1678 70.4022 152.3317 57.9300 12.6122 6.2616 5.7689 4.5140 16.1063 17.9731 15.8613
temp: 298.150 k
press: 1.00000 atm
elementType: 16 9 9 9 7 7 6 6 6 6 6 6 6 6 1 1 1 1 1 1 1
symmnumber: 1
zpe: 367733.9 jmol-1
zpe.correction: 0.140062 hartree
zpe.thermalcorrener: 0.153678 hartree
zpe.thermalcorrenthalpy: 0.154622 hartree
zpe.thermalcorrgfe: 0.096226 hartree
zpe.sumelectzpe: -1115.050588 hartree
zpe.sumelectthermal: -1115.036973 hartree
zpe.sumelectthermalent: -1115.036028 hartree
zpe.sumelectthermalfe: -1115.094425 hartree
dipole: 3.8064 2.6980 -1.5519
dipole: 4.9169
quadrupole: -70.6899 -88.4974 -88.1240
quadrupole: -1.0284 8.5059 -3.9494
quadrupole: 11.7472 -6.0603 -5.6869 -1.0284 8.5059 -3.9494
hfenergy: -1115.1906503 hartree
pointgroup: C01 [X(C8H7F3N2S1)]
dipole: 1.5233161 1.1268798 0.3896633 debye
dipolederiv: -0.8397558 0.1817755 -0.022045 0.111275 -0.0419026 0.0579566 -0.148931 0.0728763 -0.0166937 -0.239356 -0.0657183 -0.0360781 -0.0758117 -0.218108 0.1874132 -0.1095366 0.0642768 -0.7413265 -0.5657301 -0.4118297 0.0203752 -0.6348575 -0.5841596 0.1013072 0.12986 0.1876938 -0.2706888 -0.2770578 -0.0801862 -0.1469326 -0.0644383 -0.2006887 0.1223449 -0.3309397 0.0353296 -0.8093112 -1.0330805 0.1183738 -0.0935479 -0.3240406 -0.2625326 -0.1882666 -0.5618267 -0.0745232 -0.3603952 -1.1601682 0.149959 -0.0870157 0.5025375 -0.3612287 -0.057667 0.2284266 -0.1372626 -0.265442 0.0423985 -0.0457479 0.0194002 0.0864226 0.0354981 0.0872063 0.0392039 -0.0376764 -0.0101616 0.2812739 -0.1448818 -0.1200775 -0.310794 0.1765139 0.0673486 -0.1645027 0.1082556 0.1314688 0.1004154 0.1213068 0.0252177 0.1747335 0.1351588 -0.2404293 0.0385338 -0.0855479 0.7066744 1.9563972 -0.2881994 0.1756589 -0.1558338 0.1350597 0.0762104 0.3950647 0.0293533 0.1468611 0.8358202 0.5255455 0.1324577 0.6921675 0.7817748 -0.2109177 0.297986 -0.1842736 1.0605879 0.5266875 -0.1471228 -0.0020609 0.0265074 0.2307342 0.2552134 0.1728178 0.2123037 0.2272669 0.5733491 -0.0254028 0.1310283 -0.1328876 0.2428613 0.2278572 0.0352195 0.2546967 0.2391819 -0.2090862 0.0543387 0.0346841 0.0064066 -0.3069099 -0.2074381 -0.0237847 -0.1931314 -0.291322 -0.0455451 0.0233768 0.0366246 -0.0003453 -0.0498483 -0.0826748 0.0556118 -0.096428 0.0706795 0.0874588 -0.0079433 -0.02744 -0.0592043 0.1144175 0.004411 -0.0655224 0.0656291 -0.036676 -0.0364509 -0.0604443 0.0244327 -0.0009382 -0.074396 -0.0106411 0.0753448 -0.0285024 0.0558297 0.0516774 0.0353796 -0.006509 0.10291 0.0306887 -0.0056891 0.0112533 -0.0124904 -0.057519 0.0335467 -0.0296423 -0.0519985 -0.064084 0.0458311 -0.0896952 -0.0873173 -0.0817939 0.0171923 0.0030692 0.0732015 0.041817 0.0977083 0.0299171 -0.0644231 0.0641284 -0.0699068 0.0693463 -0.0858634 0.0238619 -0.0479911 0.0225667 0.1413194 -0.0294267 -0.0510894 -0.0288781 0.1344472 unknown
polarizability: 177.5028898|-7.4781647|91.211244|11.2330037|21.2753771|89.5317689 unknown
InChI: InChI=1S/C8H7F3N2S/c9-6(7(10)11)2-5-14-8-12-3-1-4-13-8/h1,3-4H,2,5H2
charge 0 multiplicity 1
21 atoms
S  0.182589 -0.125061 -0.714897
F  -2.624997 -0.03657 2.065472
F  -4.432989 -1.411512 0.426538
F  -3.894083 -0.109073 -1.368206
N  2.425491 0.656912 0.673633
N  2.664746 -1.10805 -1.00038
C  -1.91138 1.476985 0.268954
C  -0.40006 1.234742 0.472678
C  -2.77003 0.328798 0.710282
C  1.944612 -0.185848 -0.289581
C  -3.657722 -0.369284 -0.028267
C  3.760023 0.553146 0.945473
C  3.992495 -1.184282 -0.704969
C  4.600173 -0.36391 0.276819
H  -2.186647 2.37091 0.864386
H  -2.132238 1.712092 -0.787235
H  0.178008 2.144291 0.250933
H  -0.168979 0.911831 1.498506
H  4.145908 1.226959 1.718327
H  4.568236 -1.922265 -1.274075
H  5.665941 -0.436311 0.505608
