program: Gaussian 09
title: 000078572
version: EM64L-G09RevD.01
frameworkgroup: C1[X(C7H5ClN2)]
method: RPBEPBE
basis: SDD
operation: Freq
keyword: #p
keyword: freq=noraman
keyword: PBEPBE/SDD
title: #p freq=noraman PBEPBE/SDD
converged: NO NO NO NO
title: Mulliken charges:
elementType: Cl N N C C C C C C C H H H H H
charge: 0.019831 -0.384108 0.011931 0.308688 0.045508 -0.340451 -0.315795 -0.186294 -0.205677 -0.225044 0.326692 0.235776 0.251996 0.227365 0.229583
chargesum: 0.00000
title: Mulliken charges with hydrogens summed into heavy atoms:
elementType: Cl N N C C C C C C C
charge: 0.019831 -0.057416 0.011931 0.308688 0.045508 -0.104676 -0.063799 -0.186294 0.021688 0.004539
polarizability: 1.52578908e+02 -2.11993226e+00 9.13454008e+01 4.78580082e-03 -1.84442846e-03 3.72412318e+01
1716.lowfreq: -2.9165 0.0012 0.0014 0.0020 8.1182 13.8526 112.0000 209.7709 249.1542
frequency: 111.9985 209.7701 249.1518 299.5849 375.7117 424.5069 467.7011 568.5972 577.6037 581.1513 610.6237 640.7536 754.5686 764.2796 792.6500 858.6987 870.6796 924.2084 939.4799 979.7392 1006.7343 1105.8290 1145.5151 1160.9541 1203.5244 1258.1039 1278.0142 1346.8700 1406.6898 1426.9138 1466.5651 1478.6819 1592.3259 1634.0169 3133.4853 3146.4373 3161.7166 3175.3384 3601.9764
redmass: 7.8896 8.1166 4.5902 6.2994 13.8686 3.0148 5.2599 1.2972 3.7877 8.0441 6.7814 4.3322 1.4225 3.2801 5.1691 1.4487 6.6870 8.6899 1.3779 1.3067 2.0623 1.8302 1.9418 1.1708 2.6726 2.9330 2.0962 2.4176 3.0385 3.7910 5.5687 2.8277 6.8180 7.5806 1.0856 1.0907 1.0964 1.0990 1.0818
irintensity: 0.9026 0.0593 6.0358 1.4760 9.5862 11.5484 4.6636 94.7874 0.4284 7.2293 0.4702 19.3645 104.0649 14.6604 0.2461 0.0756 2.2707 13.2935 4.1861 0.0499 4.8729 5.0736 26.2063 5.8148 7.7016 41.2106 11.5512 103.6263 19.8366 173.5408 48.1394 20.9962 1.5176 9.0980 0.6102 11.5585 20.8924 13.5095 65.2247
temp: 298.150 k
press: 1.00000 atm
elementType: 17 7 7 6 6 6 6 6 6 6 1 1 1 1 1
symmnumber: 1
zpe: 279514.4 jmol-1
zpe.correction: 0.106461 hartree
zpe.thermalcorrener: 0.113848 hartree
zpe.thermalcorrenthalpy: 0.114792 hartree
zpe.thermalcorrgfe: 0.073938 hartree
zpe.sumelectzpe: -838.615600 hartree
zpe.sumelectthermal: -838.608214 hartree
zpe.sumelectthermalent: -838.607269 hartree
zpe.sumelectthermalfe: -838.648124 hartree
dipole: 1.4535 3.6298 -0.0001
dipole: 3.9100
quadrupole: -59.8992 -57.9293 -68.0309
quadrupole: -5.1045 0.0005 -0.0008
quadrupole: 2.0539 4.0239 -6.0778 -5.1045 0.0005 -0.0008
hfenergy: -838.7220614 hartree
pointgroup: C01 [X(C7H5Cl1N2)]
dipole: -0.581987 1.4239579 0.0000362 debye
dipolederiv: -0.8694733 -0.0351223 -0.000038 -0.0916052 -0.0959087 -0.0000071 -0.0001957 -0.0000144 -0.02312 -0.7935319 0.0498556 -0.0000665 -0.1220011 -0.5367938 -0.0000024 -0.0001128 -0.000059 -0.2418475 -0.8300049 -0.2073664 -0.0000769 -0.2647892 -0.5399741 -0.0000673 -0.0000883 0.0000196 -0.2014816 0.403647 0.1485967 0.0000555 0.432826 -0.0540318 0.0000214 0.0000121 -0.0000202 0.0639359 0.4121566 0.0375307 0.0000508 -0.2686654 -0.0373376 -0.000019 -0.0000051 0.0000079 0.0006608 0.0072203 -0.0798241 -0.0000017 -0.0467023 0.0600933 0.000003 0.0000273 0.000012 -0.1847206 0.0533318 -0.0246424 -0.0000071 0.0482759 0.1203319 0.0000112 0.0000188 -0.0000059 -0.143332 1.4971287 0.0033329 0.0000913 0.2249318 0.9317491 0.0000785 0.0003564 0.0000565 0.0257386 -0.0442878 -0.0171942 0.0000008 -0.126746 0.076288 0.0000131 -0.0000148 0.0000153 -0.169051 -0.0327928 0.0930301 0.0000095 0.1843173 -0.0522295 0.0000037 0.0000145 0.0000148 -0.1791956 0.1877876 0.0319451 0.0000017 0.0297184 0.2041874 -0.0000099 0.0000049 -0.0000016 0.369931 0.0765625 -0.0154767 -0.0000064 0.0169521 -0.0959267 -0.0000058 -0.0000029 -0.0000087 0.1830555 0.0971565 0.0173134 -0.0000019 -0.0150618 -0.0576011 -0.0000084 0. 0.0000015 0.1676263 -0.0813622 0.0898808 -0.0000009 0.0872421 0.0403613 -0.0000021 -0.0000011 -0.000007 0.1646561 -0.0835382 -0.0918592 -0.0000103 -0.0886928 0.0367924 -0.0000087 -0.0000132 -0.0000109 0.1671441 unknown
polarizability: 152.5457162|2.5545018|91.3785929|0.0047726|0.0018784|37.2412318 unknown
InChI: InChI=1S/C7H5ClN2/c8-7-9-5-3-1-2-4-6(5)10-7/h1-4,9H
charge 0 multiplicity 1
15 atoms
Cl 3.730565 0.028692 0.000119
N  1.198015 1.126964 0.000047
N  1.225467 -1.16472 0.000003
C  -0.155188 0.735488 -0.000027
C  -0.118376 -0.703749 -0.000091
C  -1.362261 1.462069 -0.000078
C  -1.322541 -1.441617 -0.00019
C  1.947349 -0.053051 -0.000065
C  -2.553983 0.704515 -0.000133
C  -2.534811 -0.721162 -0.000182
H  1.573271 2.073732 0.000125
H  -1.38797 2.556639 -0.000055
H  -1.300244 -2.535374 -0.000221
H  -3.518105 1.224657 -0.000126
H  -3.485488 -1.265181 -0.000226
