program: Gaussian 09
title: 000078571
version: EM64L-G09RevD.01
frameworkgroup: C1[X(C8H7ClN2)]
method: RPBEPBE
basis: SDD
operation: Freq
keyword: #p
keyword: freq=noraman
keyword: PBEPBE/SDD
title: #p freq=noraman PBEPBE/SDD
converged: YES YES NO NO
title: Mulliken charges:
elementType: Cl N N C C C C C C C C H H H H H H H
charge: -0.072353 -0.436896 -0.067852 0.299552 0.009398 0.284762 -0.361905 -0.332253 -0.734974 -0.206818 -0.229547 0.320592 0.236033 0.251267 0.305601 0.280042 0.226660 0.228690
chargesum: 0.00000
title: Mulliken charges with hydrogens summed into heavy atoms:
elementType: Cl N N C C C C C C C C
charge: -0.072353 -0.116304 -0.067852 0.299552 0.009398 0.284762 -0.125871 -0.080986 -0.149331 0.019842 -0.000857
polarizability: 1.73609607e+02 1.29777394e+00 1.01750914e+02 -6.41290238e+00 -1.13334592e+00 5.44675982e+01
1716.lowfreq: -8.5394 -0.9237 -0.0019 -0.0018 -0.0009 5.3619 36.1110 81.2829 180.6387
frequency: 36.0324 81.2727 180.6370 249.1036 254.5692 333.2649 432.9147 453.8670 508.7943 577.9747 597.6629 609.3606 615.9176 681.7129 714.8958 757.8155 771.8540 822.9272 859.0853 873.5534 914.5379 940.9605 974.7195 980.3178 1008.1128 1111.7568 1121.9399 1159.9319 1212.0412 1222.1491 1249.1441 1266.6567 1309.8135 1373.2094 1413.3038 1435.7235 1443.9076 1478.5546 1521.2315 1592.6700 1633.7299 3069.0308 3133.4116 3146.2016 3160.9775 3167.9747 3174.4834 3590.1734
redmass: 5.4483 8.2415 5.1900 3.7759 4.0349 5.4175 3.0197 4.0653 6.6559 3.4334 5.6135 1.8952 2.3811 5.0037 5.3718 1.3857 3.5113 4.4904 1.5227 3.9032 1.9202 1.3806 5.2999 1.3096 2.1372 1.5809 1.1931 1.1558 2.6499 1.4818 1.3936 2.0703 2.1861 3.6759 2.9772 2.1159 1.4364 3.3844 4.9299 6.8991 7.4745 1.0605 1.0856 1.0905 1.0961 1.1071 1.0993 1.0814
irintensity: 5.1866 3.9606 4.6224 3.3082 12.0388 1.3745 13.0195 3.6108 8.1777 4.5460 46.9703 56.0506 31.3439 36.0636 21.3420 109.6586 7.2503 16.0628 0.1424 0.7727 3.3156 3.8585 3.4016 0.0437 9.9690 6.3197 7.2095 0.3921 9.3900 32.6208 18.1601 36.4542 32.3355 51.6743 3.4167 6.9905 13.5856 1.4755 0.8403 6.4898 5.8643 13.1030 0.4892 10.5152 21.9792 0.7847 18.1440 55.0377
temp: 298.150 k
press: 1.00000 atm
elementType: 17 7 7 6 6 6 6 6 6 6 6 1 1 1 1 1 1 1
symmnumber: 1
zpe: 354213.5 jmol-1
zpe.correction: 0.134913 hartree
zpe.thermalcorrener: 0.143710 hartree
zpe.thermalcorrenthalpy: 0.144654 hartree
zpe.thermalcorrgfe: 0.099586 hartree
zpe.sumelectzpe: -877.854236 hartree
zpe.sumelectthermal: -877.845439 hartree
zpe.sumelectthermalent: -877.844495 hartree
zpe.sumelectthermalfe: -877.889563 hartree
dipole: 0.9891 -2.3566 1.7541
dipole: 3.0998
quadrupole: -68.3049 -66.2196 -72.9049
quadrupole: -1.2651 -6.4021 -1.4894
quadrupole: 0.8382 2.9236 -3.7618 -1.2651 -6.4021 -1.4894
hfenergy: -877.9891489 hartree
pointgroup: C01[X(C8H7Cl1N2)]
dipole: -0.4754169 1.0046537 0.5019141 debye
dipolederiv: -0.6835835 -0.0720884 0.0902019 -0.3125232 -0.2457791 0.1047545 0.5031718 0.1103142 -0.3416023 -0.5125329 0.0760205 -0.0560373 -0.1494866 -0.5232202 -0.0314358 -0.1064569 -0.0323475 -0.260556 -0.2949051 -0.1561365 0.0065615 0.0720142 -0.4118049 0.0034376 0.110627 0.0097726 -0.2635387 0.284772 0.1182519 0.065313 0.2749186 -0.0638989 0.057233 0.0114967 0.0321193 0.0699879 0.1223284 0.0418876 0.0331776 -0.1218878 -0.0492182 -0.0212569 -0.0192205 -0.0044659 0.0331879 -0.1416623 -0.1083397 -0.0010877 -0.1153715 0.6924557 0.0317868 -0.0596609 -0.0055797 -0.0295099 0.0164744 -0.0880905 0.0153095 -0.0449256 0.058574 -0.0143225 0.0415848 -0.0286206 -0.1863083 0.1673786 -0.0196042 0.0204351 0.0656974 0.1300308 -0.0221317 0.0191394 -0.0197817 -0.1351351 0.9611237 0.192305 -0.1860707 0.2919277 0.2325322 -0.1568458 -0.5181316 -0.1631274 0.4552905 -0.072672 -0.0184396 0.0296117 -0.1760568 0.092903 -0.0265407 0.0241859 -0.0214092 -0.1575838 -0.0717686 0.0991536 0.0182734 0.2752798 -0.0576418 0.0066075 0.002793 0.0050085 -0.1824005 0.2051597 0.0099792 -0.0196693 0.0175917 0.1971685 0.0272467 -0.0095148 0.0453428 0.3407205 0.0736877 -0.0196565 -0.0114599 0.0217124 -0.0946384 0.0186167 -0.0145943 0.0171975 0.1776339 0.0975642 0.0146555 -0.0099267 -0.0244063 -0.062402 0.0153184 -0.0089018 0.0165557 0.1638849 0.0806224 -0.0257381 0.0440296 0.0616633 -0.0138303 0.0451648 0.0288379 0.0383815 0.0648726 -0.0658497 -0.0397463 0.0185053 -0.1338937 0.0414271 -0.055089 0.0571261 -0.0174003 -0.0687686 -0.0772071 0.0890157 -0.0344529 0.0888789 0.0395458 0.0200078 -0.040219 0.0203319 0.1570419 -0.0889298 -0.0934293 -0.022714 -0.0911326 0.0377967 -0.0025513 -0.0222628 -0.0022917 0.1627832 unknown
polarizability: 172.6571139|9.7616816|101.4828195|2.0753606|-8.3318882|55.6881863 unknown
InChI: InChI=1S/C8H7ClN2/c9-5-8-10-6-3-1-2-4-7(6)11-8/h1-4,10H,5H2
charge 0 multiplicity 1
18 atoms
Cl 3.967529 0.811437 -0.842569
N  0.82461 1.101376 0.198154
N  0.815576 -1.180156 0.329529
C  -0.516059 0.72368 0.047095
C  -0.504864 -0.712649 0.146197
C  1.577788 -0.070644 0.358413
C  -1.702491 1.457979 -0.159456
C  -1.714903 -1.437944 0.046267
C  3.043728 -0.071836 0.583651
C  -2.896899 0.71368 -0.258356
C  -2.904034 -0.710019 -0.156504
H  1.21032 2.040258 0.10639
H  -1.708922 2.549996 -0.237471
H  -1.712599 -2.529269 0.122538
H  3.419527 -1.101744 0.607498
H  3.357208 0.491206 1.475153
H  -3.843899 1.241152 -0.416939
H  -3.856517 -1.244204 -0.23969
