program: Gaussian 09
title: 000078587
version: EM64L-G09RevD.01
frameworkgroup: C1[X(C10H12O3S)]
method: RPBEPBE
basis: SDD
operation: Freq
keyword: #p
keyword: freq=noraman
keyword: PBEPBE/SDD
title: #p freq=noraman PBEPBE/SDD
converged: YES YES NO NO
title: Mulliken charges:
elementType: S O O O C C C C C C C C C C H H H H H H H H H H H H
charge: 0.978516 -0.399366 -0.506038 -0.518966 -0.036351 0.454110 -0.239770 -0.235504 -0.360094 -0.359232 -0.797939 -0.328277 -0.024056 -0.537531 0.285150 0.280989 0.246304 0.245613 0.231606 0.231899 0.244894 0.224096 0.240447 0.233510 0.223606 0.222383
chargesum: 0.00000
title: Mulliken charges with hydrogens summed into heavy atoms:
elementType: S O O O C C C C C C C C C C
charge: 0.978516 -0.399366 -0.506038 -0.518966 -0.036351 0.454110 0.045380 0.045485 -0.113790 -0.113618 -0.089540 0.136266 0.209454 -0.091542
polarizability: 2.08637770e+02 1.62341996e-01 1.21640366e+02 4.36271930e+00 6.74711217e+00 1.26522531e+02
1716.lowfreq: -12.9780 -8.1367 -2.7037 0.0009 0.0009 0.0024 17.7733 21.7198 31.7295
frequency: 16.8315 21.5809 31.6647 42.5541 48.4793 90.1659 128.2464 134.1643 181.5019 219.0002 228.8110 269.7396 301.1892 318.6695 376.5448 386.1772 407.5122 413.6519 468.8378 489.1265 535.8593 594.5014 620.7936 645.2356 705.1376 777.1073 825.0719 828.6044 847.7154 886.6532 926.3895 950.8965 960.3432 963.2950 977.3323 983.7185 991.5008 994.1779 1008.1850 1049.6987 1054.4323 1119.6699 1141.0662 1185.3797 1214.5800 1218.6350 1282.4311 1297.6255 1334.7753 1382.3812 1392.9662 1400.9383 1426.2230 1470.1723 1471.0698 1472.5385 1474.0786 1594.7617 1595.6623 1654.3432 2971.7609 2981.5068 3057.0773 3064.4085 3093.5231 3094.2196 3128.3496 3138.9512 3140.8540 3165.0116 3167.8867 3204.0482
redmass: 3.2135 1.1411 3.8440 2.4155 4.4972 3.8072 6.4888 4.3507 5.2666 5.2835 8.0361 4.0775 5.1095 4.3263 5.4007 4.4022 2.8650 2.6034 6.5590 2.9910 4.3525 5.9517 6.9613 1.8280 3.3339 4.8267 2.4601 2.5127 1.2456 4.7271 1.5307 10.0980 1.3622 1.3009 1.7916 1.3849 1.4573 5.0967 1.2255 1.5974 2.4760 1.2857 1.6661 1.1387 1.2692 2.9749 1.2295 1.2621 1.2151 6.1955 2.9806 1.2194 1.1767 1.1048 1.1116 2.2403 1.0754 6.2040 6.7054 4.5884 1.0590 1.0392 1.1038 1.0946 1.0603 1.1001 1.0950 1.0893 1.0894 1.0956 1.0970 1.1147
irintensity: 0.7096 1.1410 0.5866 1.9206 1.0467 1.4831 1.6564 1.7591 6.6613 4.4436 6.9291 1.6959 7.2815 5.4932 8.5497 3.4014 0.1256 25.2858 61.5398 7.4125 155.0630 51.2752 0.1734 13.7657 1.5740 5.6226 123.6117 7.5095 0.4400 149.9108 39.3521 70.5521 91.7977 1.3282 0.0233 0.0260 4.0424 2.4993 17.9461 20.7518 24.3837 7.2795 4.7820 11.1171 7.9237 5.0285 1.0359 2.4938 8.9794 0.4179 11.0613 17.0121 19.4975 9.4663 18.3681 21.7107 13.0691 11.1397 3.6911 1.2832 38.3963 20.7677 17.0462 19.1123 9.0300 14.4946 10.8139 12.4252 6.8021 0.4441 9.6013 22.9848
temp: 298.150 k
press: 1.00000 atm
elementType: 16 8 8 8 6 6 6 6 6 6 6 6 6 6 1 1 1 1 1 1 1 1 1 1 1 1
symmnumber: 1
zpe: 514621.5 jmol-1
zpe.correction: 0.196009 hartree
zpe.thermalcorrener: 0.211687 hartree
zpe.thermalcorrenthalpy: 0.212631 hartree
zpe.thermalcorrgfe: 0.149095 hartree
zpe.sumelectzpe: -1010.745217 hartree
zpe.sumelectthermal: -1010.729539 hartree
zpe.sumelectthermalent: -1010.728595 hartree
zpe.sumelectthermalfe: -1010.792131 hartree
dipole: 3.2816 4.0833 -0.1989
dipole: 5.2423
quadrupole: -67.2904 -98.5725 -89.3551
quadrupole: -1.7022 0.5138 3.6915
quadrupole: 17.7823 -13.4998 -4.2825 -1.7022 0.5138 3.6915
hfenergy: -1010.9412261 hartree
pointgroup: C01 [X(C10H12O3S1)]
dipole: 1.2426051 -1.5656306 -0.5084725 debye
dipolederiv: 2.1989567 -0.0102746 -0.0337362 0.2867302 1.5942404 0.0973014 -0.0005124 0.0559536 1.1532564 -1.2287635 -0.2319626 -0.0183737 -0.173738 -0.5906467 -0.008693 -0.1061676 -0.0239941 -0.3883048 -0.719797 0.0315128 0.0237359 -0.0425839 -0.5837997 -0.079767 -0.0697243 -0.1968762 -0.6252908 -0.7513683 0.0356641 -0.0149877 -0.0390956 -0.6255786 0.0447562 0.0276357 0.1614449 -0.5413914 -0.0663637 -0.0246929 -0.0005568 0.0003791 -0.2337824 -0.0268063 0.0006796 -0.0134997 -0.1066092 0.4320831 -0.2110206 -0.0483651 -0.3001435 0.126106 0.0298161 -0.0597724 0.025632 0.0321803 -0.1083285 -0.0185996 -0.0929711 -0.008281 -0.0672432 0.0544718 0.2665008 -0.0773358 -0.0257579 -0.1368058 -0.0243982 0.0881464 0.0246054 -0.0693419 -0.0631348 -0.2427142 0.0689104 -0.0114751 -0.20913 0.0047152 0.1424194 0.0268208 -0.1388514 -0.0838755 0.1483558 -0.0828803 0.0242528 -0.2450172 0.0368715 -0.0988232 0.0582893 -0.1627236 0.0424968 -0.0974453 0.0381506 0.0839135 -0.1087814 0.0874071 0.0214832 0.2294664 -0.0557832 -0.0286796 0.0379375 -0.0202008 0.0718414 1.0376685 0.2914836 0.0358837 -0.3266861 0.0835041 -0.075136 0.1383817 0.0568765 0.2582086 -0.3643323 -0.0225214 -0.1521361 0.2018251 0.0330189 0.0937837 0.0206345 0.1304546 0.090962 -0.2480213 0.0900192 -0.1010342 0.0990217 -0.112148 0.1514851 -0.2539318 0.0782753 -0.0036476 0.1387231 0.0224413 0.0561701 -0.0023542 0.1414048 -0.0307821 0.0403034 -0.0034312 0.0584978 0.1195632 0.0361049 -0.0603813 0.016189 0.1295319 0.0379076 -0.0521878 0.0140306 0.0725392 -0.0030906 0.0643962 -0.0786499 0.0767416 0.1223343 0.0434979 -0.0705279 0.0415194 -0.01213 0.0200798 0.0440992 0.0797871 0.0578374 0.1342931 -0.02092 0.0781882 -0.0183284 -0.0476418 0.0057156 0.0108308 0.046216 -0.0548795 0.0850661 0.0789131 0.1196726 0.064032 -0.0550186 -0.0186972 0.0139224 -0.0514947 -0.0370918 0.1077042 -0.0416031 -0.1365878 -0.0340138 -0.052648 0.0207762 -0.0078667 0.0051767 0.0354783 -0.1172436 -0.0262143 0.0104177 -0.0241131 0.1149515 -0.1323671 -0.0137753 0.0538549 0.0009349 0.0680185 -0.0192443 0.0863119 -0.0665662 -0.0757604 0.0037879 -0.0895886 0.0141354 0.0804444 -0.0079112 0.0680083 -0.0736963 0.0454324 0.0266877 0.1209782 0.0016676 0.1070024 -0.0580363 0.0536498 -0.0511383 0.0690589 -0.0703333 -0.0491146 0.1350481 -0.080552 0.0017098 -0.1617739 -0.0274785 -0.1043507 0.0290373 -0.0871071 0.0589422 0.1074834 -0.0358833 0.075789 0.0099003 0.11366 -0.082093 0.0901522 -0.0620321 -0.051443 unknown
polarizability: 208.6610685|-1.5263501|117.711679|-3.7530239|3.4250552|130.4279195 unknown
InChI: InChI=1S/C10H12O3S/c1-3-8-13-14(11,12)10-6-4-9(2)5-7-10/h3-7H,1,8H2,2H3
charge 0 multiplicity 1
26 atoms
S  -0.862189 1.328244 0.40083
O  -1.890041 -0.23171 0.231548
O  -1.008554 1.916687 1.903074
O  -1.198265 2.269168 -0.881111
C  0.809304 0.516008 0.195463
C  3.330158 -0.656711 -0.104017
C  1.497039 0.121683 1.353421
C  1.316005 0.35993 -1.104189
C  2.769667 -0.466514 1.187225
C  2.591206 -0.229569 -1.240025
C  4.68591 -1.317609 -0.268528
C  -3.337293 0.058605 -0.015675
C  -3.873826 -1.164794 -0.709627
C  -4.844777 -1.957536 -0.190636
H  1.061317 0.286157 2.343865
H  0.745935 0.706841 -1.971608
H  3.333596 -0.78061 2.072681
H  3.017243 -0.358783 -2.24133
H  5.209372 -0.952459 -1.16885
H  5.335278 -1.135655 0.6050
H  4.57619 -2.414376 -0.374044
H  -3.847409 0.243933 0.946596
H  -3.41373 0.954688 -0.665617
H  -3.429343 -1.3901 -1.687832
H  -5.227951 -2.825887 -0.737795
H  -5.286843 -1.756731 0.79298
