program: Gaussian 09
title: 000078603
version: EM64L-G09RevD.01
frameworkgroup: C1[X(C15H14O2)]
method: RPBEPBE
basis: SDD
operation: Freq
keyword: #pfreq=noraman
keyword: PBEPBE/SDD
title: #p freq=noraman PBEPBE/SDD
converged: YES YES NO NO
title: Mulliken charges:
elementType: O O C C C C C C C C C C C C C C C H H H H H H H H H H H H H H
charge: -0.444673 -0.264032 -0.587318 -0.578939 0.456977 0.496273 0.067255 -0.406279 -0.440409 -0.389604 -0.316264 -0.226322 -0.236011 -0.226211 -0.234894 0.092156 -0.243787 0.220366 0.268067 0.214135 0.241462 0.240568 0.228613 0.269482 0.280488 0.232134 0.235552 0.221044 0.221852 0.224697 0.383622
chargesum: 0.00000
title: Mulliken charges with hydrogens summed into heavy atoms:
elementType: O O C C C C C C C C C C C C C C C
charge: -0.061052 -0.264032 -0.098886 -0.123342 0.456977 0.496273 0.067255 -0.165711 -0.211796 -0.120122 -0.035776 0.005812 -0.000458 -0.005167 -0.013042 0.092156 -0.019090
polarizability: 2.34495710e+02 9.77538894e+00 1.82957315e+02 -1.57764871e+01 -3.31903078e+00 8.07971200e+01
1716.lowfreq: -3.6192 -0.0004 0.0004 0.0006 4.8688 14.4107 32.3824 33.8338 52.0819
frequency: 32.2936 33.5968 52.0436 59.6793 103.6143 115.3875 140.9470 231.0102 244.1601 281.2444 337.1421 356.5330 394.3882 406.8099 421.7923 475.0718 490.7393 533.9837 538.5804 590.9491 603.7370 614.5462 618.4987 691.8344 707.5716 713.4701 749.4074 766.8313 784.9075 796.0323 804.1129 851.2422 860.0167 898.4114 923.5809 976.5866 980.5002 987.5086 991.0817 992.8721 996.1006 1001.6473 1004.4698 1027.1693 1047.1233 1076.8267 1110.4493 1152.1264 1167.9087 1171.1012 1180.0012 1187.7666 1210.8336 1217.1189 1265.3035 1275.1148 1302.8178 1310.5785 1323.2475 1335.1302 1382.5247 1384.4247 1431.1729 1441.0278 1469.4029 1478.1577 1481.0123 1483.8670 1575.2039 1592.3362 1606.8894 1614.0014 1631.6462 2996.2363 3006.6475 3054.7617 3088.9617 3112.2886 3119.5457 3124.5551 3131.6969 3141.3429 3142.1646 3159.2537 3159.7158 3184.3085 3529.4618
redmass: 5.2484 4.6786 6.1845 4.4793 4.4645 4.4689 4.9118 4.7304 5.4839 3.3657 2.3411 4.0573 4.9970 2.8554 3.1029 3.6554 4.2882 3.1193 6.1305 1.2586 4.3582 5.1124 5.7699 3.9132 2.1952 2.9031 2.0364 1.7914 1.3984 2.1060 3.8994 2.8311 1.2573 1.5517 1.4987 1.4744 1.3744 2.8084 2.6658 1.9753 3.8555 2.3008 1.3677 2.1939 2.2939 1.6180 1.7204 1.5141 1.2810 1.0711 1.0726 1.1200 2.4856 2.5234 1.3400 1.3481 1.4419 2.2166 1.3060 1.2695 7.3308 7.6469 2.1567 2.1752 1.1461 2.3379 1.1475 2.2615 6.4442 6.0602 6.2347 6.0672 7.6546 1.0592 1.0652 1.0991 1.1000 1.0863 1.0865 1.0867 1.0917 1.0911 1.0962 1.0967 1.1014 1.0961 1.0641
irintensity: 0.2904 0.2997 1.0395 0.0164 0.4109 0.2988 0.2075 0.3198 0.4883 3.7421 0.5262 5.3156 1.4218 0.0845 10.2004 9.9413 8.3719 25.9657 0.7586 98.7897 37.2095 6.0761 3.1748 57.5914 56.4530 11.1621 2.2528 92.5182 2.9908 14.6371 4.9225 0.4909 0.1486 0.5930 3.5331 1.5013 0.3589 1.8445 6.2258 47.2520 228.1660 2.2250 0.3762 8.6321 10.1153 0.6908 75.6704 59.1620 25.4604 3.0084 0.5969 0.6767 0.6992 0.1847 5.3890 15.7541 6.4704 70.5850 3.2429 0.3592 0.1577 3.9756 4.0587 6.1917 4.9565 28.8816 19.6033 36.7873 26.2405 2.2513 9.5817 16.8033 306.1679 16.9589 34.1391 9.9001 8.8257 9.0267 0.0446 4.5559 15.0029 14.1562 38.9710 28.3306 27.6036 8.2444 47.8700
temp: 298.150 k
press: 1.00000 atm
elementType: 8 8 6 6 6 6 6 6 6 6 6 6 6 6 6 6 6 1 1 1 1 1 1 1 1 1 1 1 1 1 1
symmnumber: 1
zpe: 652193.0 jmol-1
zpe.correction: 0.248407 hartree
zpe.thermalcorrener: 0.262971 hartree
zpe.thermalcorrenthalpy: 0.263915 hartree
zpe.thermalcorrgfe: 0.204902 hartree
zpe.sumelectzpe: -729.258655 hartree
zpe.sumelectthermal: -729.244091 hartree
zpe.sumelectthermalent: -729.243147 hartree
zpe.sumelectthermalfe: -729.302160 hartree
dipole: -1.9481 -0.9878 0.1068
dipole: 2.1869
quadrupole: -90.2944 -84.6645 -104.4607
quadrupole: 0.0852 -2.9984 -0.0218
quadrupole: 2.8454 8.4753 -11.3208 0.0852 -2.9984 -0.0218
hfenergy: -729.5070619 hartree
pointgroup: C01 [X(C15H14O2)]
dipole: -0.7804432 0.3598237 -0.0410716 debye
polarizability: 235.4450449|-7.6272031|182.1739772|14.4617392|-4.6366857|80.6311225 unknown
InChI: InChI=1S/C15H14O2/c16-15(17)14-9-5-4-8-13(14)11-10-12-6-2-1-3-7-12/h1-9,16H,10-11H2
charge 0 multiplicity 1
31 atoms
O  -2.749867 -2.850274 -0.082653
O  -0.552067 -2.209921 0.209353
C  -0.014073 0.59116 0.686149
C  0.822256 0.545381 -0.63695
C  -1.508013 0.655609 0.416648
C  2.306003 0.358582 -0.360017
C  -2.323063 -0.488432 0.122049
C  -2.139673 1.926632 0.427405
C  3.223492 1.431357 -0.490084
C  2.793929 -0.90737 0.062154
C  -3.71309 -0.324986 -0.144286
C  -3.514445 2.083204 0.15409
C  -4.308636 0.948863 -0.134611
C  4.597707 1.248735 -0.207853
C  4.165192 -1.093248 0.342753
C  -1.75713 -1.865414 0.095664
C  5.073061 -0.015229 0.209787
H  0.294171 1.481351 1.265918
H  0.242812 -0.304086 1.274804
H  0.645634 1.477397 -1.206694
H  0.447348 -0.295302 -1.248291
H  -1.530214 2.808028 0.659533
H  2.860563 2.413441 -0.819347
H  2.088785 -1.741726 0.162757
H  -4.310823 -1.214502 -0.35757
H  -3.964932 3.082052 0.170694
H  -5.37758 1.057953 -0.345395
H  5.294635 2.087878 -0.317124
H  4.528145 -2.077177 0.662144
H  6.137643 -0.160104 0.426495
H  -2.302571 -3.738551 -0.097521
