program: Gaussian 09
title: 000081552
version: EM64L-G09RevD.01
frameworkgroup: C1[X(C20H17NO4)]
method: RPBEPBE
basis: SDD
operation: Freq
keyword: #p
keyword: freq=noraman
keyword: PBEPBE/SDD
title: #p freq=noraman PBEPBE/SDD
converged: YES YES NO NO
title: Mulliken charges:
elementType: O O O O N C C C C C C C C C C C C C C C C C C C C H H H H H H H H H H H H H H H H H
charge: -0.360148 -0.283151 -0.329918 -0.189688 -0.478645 0.396908 0.434268 0.054180 -0.554634 0.327682 -0.541164 -0.415208 -0.416772 0.116726 0.323302 -0.240329 -0.236156 0.159688 -0.322686 -0.317469 -0.238078 -0.252152 0.260024 -0.766249 -0.534204 0.289322 0.264865 0.250560 0.245531 0.407711 0.231876 0.230778 0.316001 0.237248 0.227809 0.225628 0.243385 0.250391 0.283668 0.224455 0.236706 0.237938
chargesum: 0.00000
title: Mulliken charges with hydrogens summed into heavy atoms:
elementType: O O O O N C C C C C C C C C C C C C C C C C C C C
charge: -0.360148 -0.283151 -0.329918 -0.189688 -0.070934 0.396908 0.434268 0.054180 -0.265313 0.327682 -0.276299 -0.164648 -0.171241 0.116726 0.323302 -0.008452 -0.005378 0.159688 -0.006685 -0.080221 -0.010269 -0.026524 0.260024 0.011196 0.164895
polarizability: 4.35369254e+02 -1.04389184e+01 2.57792216e+02 -8.61628155e+00 -1.45143733e+01 1.15727307e+02
1716.lowfreq: -4.8770 -3.3218 -0.0006 0.0002 0.0005 6.9316 24.9236 28.9329 43.8670
frequency: 24.9071 28.9108 43.8537 62.2969 70.6186 81.0929 92.7012 99.1354 102.1541 118.6334 146.3066 161.4035 184.2325 195.0733 228.7980 252.1149 257.6439 283.1342 301.4662 313.5200 319.5878 332.7283 367.1633 424.5470 461.1849 469.5219 479.9541 481.9916 509.6503 531.0263 551.1099 559.9507 562.8440 569.9878 598.4811 607.1966 635.0225 655.9634 709.6072 733.0298 738.2157 750.6559 754.5591 763.2430 780.2996 782.2265 811.4177 823.4920 851.6413 855.6789 861.9896 869.8058 905.3465 907.8249 940.0792 950.0162 976.0387 988.6217 989.0307 995.0401 995.3546 1020.9820 1030.8072 1043.6294 1049.5527 1104.6765 1114.8980 1136.7970 1137.6404 1151.1611 1163.5231 1173.8312 1174.3153 1198.2264 1202.8746 1238.5628 1257.6446 1259.9656 1276.4949 1301.5625 1324.5870 1389.8222 1391.9912 1401.7928 1427.2994 1427.6117 1436.5257 1447.1756 1452.6855 1455.7171 1459.0017 1467.4567 1470.2953 1485.4243 1506.4234 1523.1559 1565.9275 1586.5053 1599.8602 1602.3024 1611.6967 1640.9596 1690.7059 2966.1955 2999.6286 3056.6197 3090.5015 3122.4691 3125.4716 3131.8805 3136.2054 3141.6491 3146.1583 3147.4382 3153.8763 3164.9691 3169.8446 3170.4419 3199.2235 3421.6054
redmass: 5.1111 6.2514 6.3124 4.1121 4.5796 4.0916 4.4103 4.1376 4.0924 1.2012 4.9387 5.9061 2.5722 6.4092 1.8031 3.7265 3.0055 6.1156 4.0494 4.4825 5.3901 4.8928 7.5986 3.7829 3.4894 5.0930 3.9788 3.1833 6.1284 4.0200 4.0532 3.9155 4.5868 5.6051 6.5205 5.8693 6.1812 5.5857 6.1393 4.0493 5.0838 4.2610 1.3449 1.3421 3.4703 3.2913 5.6737 1.3127 3.0966 1.3841 1.7577 3.8767 2.3455 2.9640 1.3455 1.5008 1.4548 1.8470 2.9324 1.5014 1.9218 2.4346 5.0877 2.0569 1.6230 2.3161 1.2666 1.6439 2.1818 1.4381 2.1277 1.0761 1.0873 2.3733 2.3062 1.5878 2.0688 2.7610 1.7965 1.8786 2.2776 7.0354 1.2231 5.5417 1.6967 2.8589 3.0585 1.7254 2.2713 1.2330 1.0619 1.0686 1.4624 1.5023 3.9921 2.3413 6.0374 7.1796 6.0958 5.1082 5.4407 6.7047 10.1149 1.0323 1.0380 1.1041 1.0955 1.1002 1.0856 1.0891 1.0857 1.1016 1.0930 1.0939 1.0915 1.1006 1.0978 1.0925 1.0949 1.0781
irintensity: 1.7547 0.3609 0.6540 3.8811 0.9234 0.3057 5.0846 3.8056 1.9821 0.0612 0.6890 1.5893 2.4597 3.3169 1.4195 2.0853 1.0210 1.5371 5.6431 1.2987 4.6216 1.5214 3.9907 0.1249 8.0764 9.1806 3.5599 21.0708 33.8803 1.1929 1.5973 1.6776 7.4810 1.8322 2.1626 0.2353 8.7242 7.2126 13.9917 0.5257 9.8629 9.6191 74.8402 74.4995 7.1703 8.3414 46.2909 100.0721 25.9550 1.1993 5.1362 33.3106 16.7577 21.3692 6.5809 5.1052 16.9246 16.1553 38.1667 23.3856 82.8617 15.9488 101.2159 25.1370 7.9937 23.6874 0.6658 27.5300 271.0824 21.4022 83.9581 9.7288 1.7851 74.0224 147.5687 6.1204 62.9781 9.8529 8.7637 44.6564 27.8231 46.3043 37.3465 21.5882 62.5596 4.6044 21.2864 80.6746 18.1426 14.4139 40.9491 9.5443 89.1754 12.1167 9.4086 638.0133 18.5830 39.8695 47.1226 58.7495 48.1661 18.0583 172.0215 69.8921 5.1587 37.5154 6.3329 21.9300 1.4933 0.3363 0.8433 4.7733 13.0022 13.5406 22.4804 43.2532 24.9559 2.0354 10.5350 150.6747
temp: 298.150 k
press: 1.00000 atm
elementType: 8 8 8 8 7 6 6 6 6 6 6 6 6 6 6 6 6 6 6 6 6 6 6 6 6 1 1 1 1 1 1 1 1 1 1 1 1 1 1 1 1 1
symmnumber: 1
zpe: 847227.5 jmol-1
zpe.correction: 0.322692 hartree
zpe.thermalcorrener: 0.344778 hartree
zpe.thermalcorrenthalpy: 0.345723 hartree
zpe.thermalcorrgfe: 0.270212 hartree
zpe.sumelectzpe: -1126.247564 hartree
zpe.sumelectthermal: -1126.225477 hartree
zpe.sumelectthermalent: -1126.224533 hartree
zpe.sumelectthermalfe: -1126.300044 hartree
dipole: -1.9113 3.9798 -2.8824
dipole: 5.2725
quadrupole: -109.5981 -135.7819 -152.8455
quadrupole: -15.1110 -0.2254 -7.2534
quadrupole: 23.1437 -3.0400 -20.1037 -15.1110 -0.2254 -7.2534
hfenergy: -1126.5702555 hartree
pointgroup: C01 [X(C20H17N1O4)]
dipole: -0.701105 -1.4432778 1.3147067 debye
polarizability: 435.5126737|8.6424665|253.5117256|-7.440786|-28.431603|119.8643775 unknown
InChI: InChI=1S/C20H17NO4/c1-13(22)25-19-12-15-8-4-3-7-14(15)11-16(19)20(23)21-17-9-5-6-10-18(17)24-2/h3-12,21H,1-2H3
charge 0 multiplicity 1
42 atoms
O  0.220932 -1.60889 0.221435
O  -0.384266 2.50773 -0.781132
O  -3.189937 -1.136414 1.050915
O  1.091943 -3.265484 -1.213932
N  -1.415034 0.581927 0.06848
C  3.499782 1.104348 -0.084149
C  3.751592 -0.300078 0.1630
C  1.05504 0.675856 -0.141719
C  2.151671 1.547086 -0.228514
C  1.339264 -0.717028 0.094865
C  2.638332 -1.193393 0.24744
C  4.611182 2.007385 -0.174567
C  5.103899 -0.752286 0.310376
C  -0.305357 1.322338 -0.322437
C  -2.771042 0.99343 0.036454
C  5.918699 1.540729 -0.026634
C  6.165729 0.150615 0.217913
C  -3.733686 0.077993 0.570651
C  -3.228322 2.234779 -0.474856
C  -5.104972 0.39717 0.597106
C  -4.605913 2.549251 -0.450223
C  -5.543434 1.640867 0.082729
C  0.188338 -2.871522 -0.460661
C  -1.081827 -3.596028 -0.088639
C  -4.085733 -2.030793 1.788284
H  1.931225 2.601976 -0.425896
H  2.815799 -2.258731 0.41556
H  4.416451 3.069394 -0.363441
H  5.293801 -1.816445 0.492189
H  -1.240371 -0.366682 0.427267
H  6.763066 2.234603 -0.098141
H  7.19701 -0.201453 0.330256
H  -2.492275 2.9331 -0.87497
H  -5.834056 -0.306997 1.008581
H  -4.93976 3.512826 -0.849009
H  -6.610009 1.88838 0.102237
H  -0.980358 -4.007016 0.933036
H  -1.250095 -4.42466 -0.791561
H  -1.937192 -2.900931 -0.08434
H  -4.884829 -2.428891 1.133604
H  -4.537434 -1.511335 2.654319
H  -3.44925 -2.856025 2.140925
