program: Gaussian 09
title: 000078562
version: EM64L-G09RevD.01
frameworkgroup: C1[X(C9H12N2O2)]
method: RPBEPBE
basis: SDD
operation: Freq
keyword: #p
keyword: freq=noraman
keyword: PBEPBE/SDD
title: #p freq=noraman PBEPBE/SDD
converged: NO YES NO NO
title: Mulliken charges:
elementType: O O N N C C C C C C C C C H H H H H H H H H H H H
charge: -0.440054 -0.311996 -0.165147 -0.510231 0.533600 0.301965 -0.628506 -0.376352 0.336442 -0.630721 -0.670822 -0.168774 -0.386896 0.319753 0.204135 0.311634 0.224021 0.224089 0.290338 0.249545 0.235088 0.235027 0.225250 0.250399 0.348214
chargesum: 0.00000
title: Mulliken charges with hydrogens summed into heavy atoms:
elementType: O O N N C C C C C C C C C
charge: -0.091840 -0.311996 -0.165147 -0.190478 0.533600 0.301965 -0.424370 -0.064718 0.336442 0.107727 0.048837 0.056476 -0.136497
polarizability: 1.84449034e+02 3.72903174e+00 1.26796712e+02 4.43367387e-02 1.77468995e-01 5.86829967e+01
1716.lowfreq: -0.0009 -0.0008 -0.0003 0.8462 7.7712 10.8360 30.1625 57.9346 72.3077
frequency: 28.6650 57.7952 72.2602 114.0372 118.9493 157.1741 205.1574 226.2136 253.1783 259.8575 265.7804 330.1361 376.0207 422.5901 435.6699 447.2354 516.0358 533.7132 595.9529 611.2483 632.0059 683.6534 703.0940 757.6081 788.3827 826.4481 854.2862 902.9006 929.3530 979.7947 986.9548 1021.5161 1059.0259 1078.2838 1094.3267 1135.8963 1136.3689 1160.9023 1170.2292 1203.8942 1258.1589 1298.2061 1313.2148 1343.0282 1387.3954 1419.5007 1425.7210 1447.5956 1480.3331 1482.0193 1493.8652 1495.8755 1502.4925 1527.2484 1613.7808 1621.7018 1628.6096 2936.4472 2966.5590 3003.3049 3040.2269 3088.6719 3098.4951 3118.0928 3141.0152 3178.8734 3204.4744 3552.2033 3581.6677
redmass: 3.0005 3.9564 1.7387 2.2592 4.1748 1.1658 2.3946 4.2515 4.2834 3.2879 5.7729 1.1381 3.9279 3.8191 3.5109 2.7579 7.3735 1.2866 5.5492 4.0242 5.7339 2.0389 11.0573 6.8750 1.2579 2.0543 6.3489 1.3728 3.6930 6.0439 1.3006 2.2672 1.4214 1.5841 1.2356 1.3387 1.5180 1.9682 1.1106 1.5106 5.4754 2.1691 1.7465 2.6504 5.3990 1.1554 3.1097 1.1940 1.0464 1.0964 1.0482 1.1705 2.7123 2.0964 6.6882 5.8082 4.3436 1.0385 1.0366 1.1018 1.1024 1.0909 1.0940 1.0963 1.0889 1.0953 1.0948 1.0753 1.0660
irintensity: 0.2690 0.0358 6.8859 1.6276 1.3295 0.0057 1.3146 3.5780 2.6735 3.7423 2.2935 140.1328 28.3005 14.8851 2.7941 20.5643 3.6337 50.3880 5.7976 7.6502 0.9862 31.1670 19.1515 8.3185 14.0923 96.4275 2.8549 5.0833 36.2932 1.5258 5.4542 32.9597 19.2325 34.1135 0.0544 9.7175 163.5027 262.7751 13.2555 85.9970 6.9866 30.5502 10.8106 41.0365 223.2847 43.2288 161.5638 39.4072 24.2437 28.4351 11.2122 205.6817 124.7641 185.7639 232.3972 57.4915 260.0722 54.8632 100.3659 41.6679 45.4660 20.3801 17.7790 0.8052 14.8563 5.6756 10.0477 9.4753 27.3496
temp: 298.150 k
press: 1.00000 atm
elementType: 8 8 7 7 6 6 6 6 6 6 6 6 6 1 1 1 1 1 1 1 1 1 1 1 1
symmnumber: 1
zpe: 525049.2 jmol-1
zpe.correction: 0.199981 hartree
zpe.thermalcorrener: 0.213297 hartree
zpe.thermalcorrenthalpy: 0.214241 hartree
zpe.thermalcorrgfe: 0.159338 hartree
zpe.sumelectzpe: -609.143433 hartree
zpe.sumelectthermal: -609.130117 hartree
zpe.sumelectthermalent: -609.129173 hartree
zpe.sumelectthermalfe: -609.184075 hartree
dipole: 3.1754 5.3600 -0.0005
dipole: 6.2300
quadrupole: -72.8316 -67.6535 -81.4875
quadrupole: 7.7225 -0.0172 0.0591
quadrupole: 1.1593 6.3373 -7.4966 7.7225 -0.0172 0.0591
hfenergy: -609.3434135 hartree
pointgroup: C01 [X(C9H12N2O2)]
dipole: -1.2400237 2.1142558 0.0010938 debye
dipolederiv: -0.8239595 -0.6337596 0.0024547 -0.7708877 -0.7303889 0.0009363 0.0027373 0.0008923 -0.4319937 -0.8193584 0.0360819 0.0004619 -0.0679471 -1.0575692 -0.0013416 0.0022533 -0.0050709 -0.384259 -1.4812808 0.3331641 0.0008345 0.3651974 -0.7114187 0.0013592 0.0055807 -0.0053352 -0.3576121 -2.1752481 0.034995 -0.000775 -0.2953899 -0.3156119 -0.0031483 0.0009105 -0.0025958 -0.350961 1.5491781 -0.130686 0.0008567 -0.5935146 0.2779987 -0.0007118 0.0009983 -0.0002578 0.1432333 2.6232402 -0.3358478 -0.0032921 0.2389161 1.3017212 0.0023115 -0.0068796 0.0042052 0.2960724 -0.6542174 -0.1633587 0.0003897 -0.1253107 -0.0722692 -0.0006088 0.0011413 -0.0010338 -0.2972882 -0.4776508 0.0430358 -0.0000426 0.3984107 -0.2284439 0.0000636 -0.0015355 0.0007304 -0.21739 0.8604094 0.4894695 -0.0016727 0.7302872 0.8441212 -0.0027237 -0.0026861 -0.0026282 0.109406 0.565183 0.1156911 0.0030135 0.3572833 -0.0043196 -0.0017387 0.0004816 -0.0003027 0.2707232 -0.0112371 0.0545329 -0.0001358 -0.18757 0.4818806 -0.0050308 -0.0021705 -0.0034681 0.2858887 0.3962122 0.0027788 0.0000565 0.0252201 0.2132124 -0.0012798 -0.0000044 -0.0010855 -0.1227344 -0.2089382 -0.0016629 0.000027 -0.3258034 -0.3461157 0.0004955 0.0012835 0.0004097 -0.2242796 0.1870004 -0.0518123 -0.0007144 -0.0267419 0.067661 0.0012632 -0.0004448 0.0020641 0.2854303 0.0419839 0.0551217 -0.0001988 0.0458312 -0.1342758 0.0011923 -0.0000606 0.0010904 0.1839089 0.1768754 -0.0629607 0.0002614 -0.0505887 0.0827302 0.0004198 0.0005105 0.0000266 0.1910193 -0.1264718 -0.0044171 -0.0851291 0.0193987 0.1000731 0.08092 -0.1651271 0.0458359 -0.092123 -0.1281744 -0.0058115 0.0854638 0.0190377 0.1013358 -0.0764955 0.1650846 -0.0421216 -0.0917594 0.2129815 0.0580012 0.0006467 -0.0592418 -0.0165021 -0.0020603 0.0002792 -0.0010411 0.1326583 -0.1212229 0.1041128 0.0058207 0.0364154 0.0742877 0.0003886 0.0050794 -0.0012862 0.1243735 0.0875631 -0.1094794 0.1007292 0.000357 -0.0542863 0.0469575 0.0656902 0.1022129 -0.0855826 0.0832406 -0.1132443 -0.1077383 -0.0058781 -0.04568 -0.0433411 -0.0719841 -0.0934111 -0.0786664 0.0646419 0.0480328 -0.0002497 0.071517 -0.1062614 0.0009784 -0.0003333 0.0009398 0.1477931 -0.0702047 0.0386323 -0.0002167 0.0324576 0.0946561 0.0003394 -0.000106 0.000352 0.1841019 0.2494544 0.1993906 -0.000851 0.1685442 0.1834646 0.0008548 -0.0006985 0.0008786 0.3800402 unknown
polarizability: 184.4152021|-3.9816397|126.8306952|0.0706308|-0.1406096|58.6828459 unknown
InChI: InChI=1S/C9H12N2O2/c1-11(2)9(13)10-7-4-3-5-8(12)6-7/h3-6,10,12H,1-2H3
charge 0 multiplicity 1
25 atoms
O  3.960563 1.572136 -0.005255
O  -1.969707 -1.599739 -0.007194
N  -3.160225 0.417495 0.002147
N  -0.799813 0.450415 -0.001504
C  0.546983 -0.006711 -0.000045
C  -1.972139 -0.329277 0.000295
C  1.559226 0.994472 -0.00347
C  0.913819 -1.37809 0.004932
C  2.920438 0.621568 -0.001873
C  -4.439091 -0.310384 -0.013042
C  -3.19746 1.886429 0.013763
C  2.285167 -1.716913 0.006705
C  3.300334 -0.739245 0.003387
H  -0.907886 1.464784 -0.008295
H  1.280431 2.058783 -0.007249
H  0.133833 -2.13967 0.00674
H  -5.029652 -0.056593 -0.914369
H  -5.039892 -0.075282 0.886547
H  -4.216835 -1.388019 -0.022563
H  -4.248088 2.215737 0.037712
H  -2.739293 2.329066 -0.895324
H  -2.70426 2.313045 0.911659
H  2.566203 -2.775954 0.010692
H  4.361792 -1.000387 0.004665
H  3.598652 2.492735 -0.009163
