program: Gaussian 09
title: 000078602
version: EM64L-G09RevD.01
frameworkgroup: C1[X(C14H11ClO2)]
method: RPBEPBE
basis: SDD
operation: Freq
keyword: #p
keyword: freq=noraman
keyword: PBEPBE/SDD
title: #p freq=noraman PBEPBE/SDD
converged: YES YES NO NO
title: Mulliken charges:
elementType: Cl O O C C C C C C C C C C C C C C H H H H H H H H H H H
charge: -0.064552 -0.449775 -0.246783 -0.716347 0.429541 0.527718 0.063972 -0.359419 -0.454397 -0.357784 -0.334870 -0.224763 -0.239803 -0.203052 -0.208834 -0.113390 0.084296 0.223661 0.270856 0.240351 0.235143 0.258492 0.274287 0.233822 0.238577 0.253700 0.252653 0.386701
chargesum: 0.00000
title: Mulliken charges with hydrogens summed into heavy atoms:
elementType: Cl O O C C C C C C C C C C C C C C
charge: -0.064552 -0.063074 -0.246783 -0.221831 0.429541 0.527718 0.063972 -0.119069 -0.219254 -0.099292 -0.060583 0.009059 -0.001226 0.050648 0.043819 -0.113390 0.084296
polarizability: 2.20321708e+02 7.64256651e+00 1.55207887e+02 1.10064495e+01 7.84454647e+00 1.16920945e+02
1716.lowfreq: -0.9198 0.0021 0.0021 0.0027 5.7948 8.1569 23.1972 26.4989 37.1643
frequency: 23.1421 26.4839 37.1266 55.6112 105.8935 129.0373 171.9437 214.8312 253.5440 289.9160 299.1456 363.5611 382.3532 388.6203 409.2429 417.4660 485.3004 487.1952 515.4528 586.0755 602.6502 606.6438 627.4699 635.8608 691.7179 704.4244 722.0517 758.8711 791.1420 794.0614 825.8837 830.3919 846.3538 898.8445 928.2125 954.8271 968.8151 979.0319 1000.1856 1003.4168 1003.8448 1055.6029 1071.6504 1081.8388 1107.4758 1164.8152 1175.6949 1183.3651 1189.3375 1191.4927 1212.6499 1282.2569 1298.1307 1307.8204 1320.3612 1375.1031 1385.7394 1396.1965 1433.8813 1470.5178 1477.2277 1480.1609 1573.5085 1587.4069 1598.6451 1608.4405 1633.3357 3004.2034 3096.2058 3125.8599 3126.5838 3142.0583 3147.1184 3155.2673 3167.6325 3171.4068 3171.5858 3507.9955
redmass: 5.0244 6.0270 6.9637 8.5293 5.5002 5.5983 8.3414 5.4625 6.3096 6.7033 4.7315 7.5267 7.4893 2.3271 2.9083 3.0669 3.6783 3.4602 4.4274 4.6064 4.2748 1.3717 6.5853 4.4769 3.5998 4.2422 3.0765 3.3016 1.7340 2.3104 3.4237 1.3316 2.0129 1.5172 1.7015 1.4747 1.3921 1.3926 4.3574 1.5831 3.3160 2.2140 2.7359 2.2579 1.4093 1.6430 1.1174 1.1409 1.1668 2.3755 2.4627 1.5145 1.3169 2.6038 1.4047 7.0903 6.4403 2.5921 2.2420 1.5305 2.4396 1.5058 6.7734 7.2312 6.2417 6.1365 8.0893 1.0677 1.0927 1.0891 1.0875 1.0898 1.0888 1.0940 1.0952 1.0969 1.1000 1.0638
irintensity: 0.6014 0.8755 0.4384 0.6362 0.3623 0.4732 0.4391 2.3766 0.9769 0.4463 0.6645 10.4343 4.4014 5.6471 0.1595 5.4847 20.7392 8.1539 12.8216 16.9743 33.8514 61.9237 0.6412 12.2011 43.5985 16.8844 41.1543 38.8153 29.4405 22.6356 8.7452 0.1728 30.1309 0.2769 4.8575 0.9112 3.0024 3.7799 33.4484 47.4465 153.1058 15.6715 41.5311 29.1331 17.0113 83.5901 0.1697 0.9198 9.8831 4.2546 7.6406 1.6560 1.0415 78.0293 3.5839 2.2754 7.7482 5.0274 22.9311 67.4706 5.1488 48.2525 1.9935 1.5075 3.2447 72.4785 302.2702 21.6852 4.6162 10.6523 5.6029 10.6788 2.4592 9.8395 7.6621 2.0780 17.9724 40.6889
temp: 298.150 k
press: 1.00000 atm
elementType: 17 8 8 6 6 6 6 6 6 6 6 6 6 6 6 6 6 1 1 1 1 1 1 1 1 1 1 1
symmnumber: 1
zpe: 552048.0 jmol-1
zpe.correction: 0.210264 hartree
zpe.thermalcorrener: 0.224932 hartree
zpe.thermalcorrenthalpy: 0.225876 hartree
zpe.thermalcorrgfe: 0.165660 hartree
zpe.sumelectzpe: -1149.420745 hartree
zpe.sumelectthermal: -1149.406077 hartree
zpe.sumelectthermalent: -1149.405133 hartree
zpe.sumelectthermalfe: -1149.465349 hartree
dipole: -0.8964 1.2642 1.1114
dipole: 1.9071
quadrupole: -125.4684 -93.9018 -100.9971
quadrupole: -5.3488 5.2137 1.2644
quadrupole: -18.6793 12.8873 5.7920 -5.3488 5.2137 1.2644
hfenergy: -1149.6310088 hartree
pointgroup: C01 [X(C14H11Cl1O2)]
dipole: 0.3485545 0.4778592 -0.4616499 debye
polarizability: 220.5758187|-8.5611605|154.9274368|8.4531813|-8.9848904|116.9472839 unknown
InChI: InChI=1S/C14H11ClO2/c15-12-7-5-10(6-8-12)9-11-3-1-2-4-13(11)14(16)17/h1-8,16H,9H2
charge 0 multiplicity 1
28 atoms
Cl -5.499161 -0.035507 1.156979
O  1.429578 -2.489861 -0.156614
O  3.659397 -2.243502 0.385209
C  0.143262 -0.193573 -1.360512
C  1.217575 0.458314 -0.482219
C  -1.25336 -0.150388 -0.738266
C  2.307467 -0.224535 0.144467
C  1.143098 1.867622 -0.318685
C  -2.309082 0.554956 -1.366926
C  -1.522357 -0.825766 0.481319
C  3.285939 0.515805 0.872812
C  2.099629 2.589934 0.420549
C  3.18726 1.909058 1.017533
C  -3.605367 0.595976 -0.801297
C  -2.808278 -0.796639 1.06266
C  -3.831789 -0.081362 0.410028
C  2.559176 -1.697245 0.124919
H  0.117778 0.349496 -2.324522
H  0.412069 -1.237824 -1.577517
H  0.308259 2.401699 -0.787569
H  -2.126215 1.07798 -2.313391
H  -0.720459 -1.385545 0.974179
H  4.118595 -0.037073 1.319133
H  2.003986 3.676378 0.525351
H  3.943748 2.458724 1.586946
H  -4.416156 1.141633 -1.292693
H  -3.011289 -1.319723 2.001811
H  1.707796 -3.445733 -0.122184
