program: Gaussian 09
title: 000078591
version: EM64L-G09RevD.01
frameworkgroup: C1[X(C14H21N2O4P)]
method: RPBEPBE
basis: SDD
operation: Freq
keyword: #p
keyword: freq=noraman
keyword: PBEPBE/SDD
title: #p freq=noraman PBEPBE/SDD
converged: YES YES NO NO
title: Mulliken charges:
elementType: P O O O O N N C C C C C C C C C C C C C C H H H H H H H H H H H H H H H H H H H H H
charge: 1.364194 -0.555976 -0.246175 -0.247574 -0.605131 -0.558812 -0.529928 -0.306597 -0.306026 -0.305541 -0.315597 -0.290926 -0.294594 -0.293901 -0.291304 0.369070 -0.337280 -0.386719 -0.207964 -0.196294 -0.251165 0.243059 0.220953 0.260237 0.225822 0.238536 0.232967 0.257939 0.228506 0.185009 0.223518 0.222699 0.192101 0.184767 0.223591 0.224001 0.190832 0.304072 0.248955 0.228940 0.228531 0.229208
chargesum: 0.00000
title: Mulliken charges with hydrogens summed into heavy atoms:
elementType: P O O O O N N C C C C C C C C C C C C C C
charge: 1.364194 -0.555976 -0.246175 -0.247574 -0.605131 -0.558812 -0.529928 0.157415 0.180033 0.165962 0.170848 0.117601 0.120206 0.114457 0.123529 0.369070 -0.033208 -0.137764 0.020976 0.032237 -0.021957
polarizability: 2.39568131e+02 -1.95260076e+00 1.71595780e+02 4.44861807e-01 1.09800204e+01 1.75220403e+02
1716.lowfreq: -8.5142 -0.0009 -0.0003 0.0004 0.3778 6.5570 17.3651 23.7724 29.3726
frequency: 17.0794 23.6754 29.1482 37.9734 48.4849 56.4737 96.9358 128.2574 142.4538 169.1897 205.0827 215.9034 227.1702 243.0240 250.5009 270.5477 287.5862 304.3388 319.9375 385.3483 395.3835 406.2960 411.1288 442.3728 449.8910 455.1544 460.3689 491.1466 539.4954 543.5461 582.2346 605.8767 628.1140 663.7181 685.4549 694.6309 762.6070 791.6451 793.3993 822.1825 837.7056 838.7486 840.1396 899.4556 900.6527 914.1173 931.8901 940.8037 971.2272 984.7892 989.8817 1012.3574 1015.0989 1017.4258 1022.3576 1049.5997 1052.5304 1057.3242 1063.7576 1070.9811 1073.8641 1077.1682 1113.4566 1118.4062 1146.3941 1163.4866 1164.9993 1172.2733 1192.6886 1194.4767 1195.0986 1246.5389 1250.8294 1272.4442 1275.1354 1309.1616 1311.1660 1316.9834 1328.9122 1331.7613 1342.4083 1344.6582 1359.7207 1362.0596 1367.4468 1369.6303 1379.2518 1439.9958 1440.5493 1441.3290 1446.8429 1447.9636 1449.8161 1451.7021 1459.1228 1460.8645 1471.9074 1591.1821 1603.1295 2939.2009 2941.5145 2951.1861 2952.3830 2959.4604 2963.0671 2964.6186 2967.1328 3053.1662 3060.9734 3068.9616 3079.6503 3080.7614 3085.8311 3087.2695 3095.3823 3129.1956 3138.5656 3153.6313 3161.8492 3171.6837
redmass: 5.1343 4.3662 3.2783 4.7652 3.6096 4.2864 6.0678 5.3781 5.2315 4.6818 3.3524 4.1728 3.6125 3.4667 4.0790 2.6224 5.0301 3.3484 3.4601 2.2356 2.0129 3.4668 2.9539 7.8759 6.3667 3.0135 2.8277 3.7492 5.3615 3.3897 2.3987 5.7453 3.2134 4.7548 3.7248 2.2974 1.5429 4.1706 4.1974 6.0459 1.6500 1.6514 1.2849 2.3815 2.3739 1.4151 3.5089 3.3008 1.3633 5.6565 1.3394 4.4267 2.5009 2.4225 2.1907 2.1045 2.0113 2.2337 2.5071 3.8546 4.2687 1.5708 2.2132 2.2344 5.0161 2.4422 1.7102 1.2931 1.4843 1.2546 1.0856 1.2774 1.3359 1.2052 1.2133 1.3711 1.3578 1.4228 1.2255 1.2260 1.2331 1.2266 1.3409 1.3367 1.2443 1.2512 8.2167 1.0831 2.2813 1.0854 1.0918 1.0865 1.0922 1.0815 1.0869 1.0897 2.2124 6.4283 6.2786 1.0681 1.0686 1.0684 1.0689 1.0637 1.0642 1.0660 1.0644 1.0972 1.0967 1.0971 1.0958 1.0959 1.0977 1.0976 1.0942 1.0849 1.0893 1.0933 1.0966 1.1009
irintensity: 0.2410 0.1308 0.1747 0.1883 0.3507 0.2993 4.0559 0.7652 0.9574 7.8112 7.7103 10.3935 2.1582 4.1254 4.2859 15.3564 2.1012 21.7942 2.2904 3.4215 0.2788 0.8105 0.3543 47.3349 58.2700 4.9362 0.5149 33.1538 5.1496 1.9637 14.4251 18.3828 6.6951 121.3774 36.5980 33.7801 91.8793 6.8981 7.3134 218.2989 2.4563 9.7559 8.4277 6.6107 22.8526 5.3489 113.2883 261.4660 1.8147 3.1623 3.2425 63.7706 15.2510 11.7050 24.3433 27.8449 4.5403 42.2007 75.5453 23.9777 33.4080 7.4341 46.7605 60.2756 65.1593 16.8682 40.8268 50.2579 87.4507 40.4012 1.8727 65.0909 32.0494 5.1603 5.0486 1.4011 1.1284 4.1236 1.2882 0.5118 3.4299 6.6465 0.2049 1.0521 2.6135 0.9701 2.6816 5.0519 7.9447 3.1731 13.0652 2.4560 22.0253 5.6296 16.2688 6.8811 138.1043 30.1504 64.8071 42.0916 66.3388 51.9258 25.8972 49.3635 34.7470 100.1534 73.5745 21.9184 13.8941 8.4819 36.7101 31.3489 44.5221 30.0593 5.8483 0.4211 16.6274 9.9334 20.5701 16.8902
temp: 298.150 k
press: 1.00000 atm
elementType: 15 8 8 8 8 7 7 6 6 6 6 6 6 6 6 6 6 6 6 6 6 1 1 1 1 1 1 1 1 1 1 1 1 1 1 1 1 1 1 1 1 1
symmnumber: 1
zpe: 897109.0 jmol-1
zpe.correction: 0.341691 hartree
zpe.thermalcorrener: 0.362095 hartree
zpe.thermalcorrenthalpy: 0.363039 hartree
zpe.thermalcorrgfe: 0.289891 hartree
zpe.sumelectzpe: -1296.046998 hartree
zpe.sumelectthermal: -1296.026594 hartree
zpe.sumelectthermalent: -1296.025650 hartree
zpe.sumelectthermalfe: -1296.098798 hartree
dipole: 0.1095 0.5653 -2.0478
dipole: 2.1272
quadrupole: -127.7552 -140.2993 -133.3502
quadrupole: 3.3031 3.0726 7.4253
quadrupole: 6.0464 -6.4978 0.4514 3.3031 3.0726 7.4253
hfenergy: -1296.3886889 hartree
pointgroup: C01 [X(C14H21N2O4P1)]
dipole: 0.0715669 -0.3540989 -0.7549387 debye
polarizability: 233.1182556|20.5946734|174.4196124|2.657404|-9.3422498|178.8464463 unknown
InChI: InChI=1S/C14H21N2O4P/c17-21(15-6-10-18-11-7-15,16-8-12-19-13-9-16)20-14-4-2-1-3-5-14/h1-5H,6-13H2
charge 0 multiplicity 1
42 atoms
P  -0.31933 0.225014 0.84713
O  0.482585 1.287149 -0.327359
O  -4.598323 0.890324 -0.721492
O  0.148913 -4.229947 -0.101284
O  0.074518 0.494613 2.373731
N  -1.923513 0.515968 0.24654
N  -0.020847 -1.422845 0.414491
C  -3.039512 -0.287207 0.814008
C  -2.364005 1.861281 -0.208954
C  -0.208341 -1.925013 -0.966326
C  0.860535 -2.271183 1.253637
C  -4.132584 -0.426404 -0.261281
C  -3.470162 1.67127 -1.261102
C  -0.740978 -3.369452 -0.896592
C  0.290229 -3.700136 1.268252
C  1.882388 1.532044 -0.304748
C  2.626457 1.64439 0.894415
C  2.492785 1.71544 -1.566448
C  4.007134 1.935946 0.80976
C  3.870595 2.017901 -1.629764
C  4.634485 2.125342 -0.443318
H  -3.462267 0.210854 1.712158
H  -2.664226 -1.284004 1.108894
H  -1.506735 2.396451 -0.646602
H  -2.761395 2.450667 0.644639
H  0.757719 -1.910276 -1.51319
H  -0.925979 -1.273325 -1.495967
H  0.899002 -1.848666 2.27316
H  1.888698 -2.288033 0.835409
H  -3.734575 -1.008457 -1.121898
H  -5.025908 -0.928676 0.145871
H  -3.902762 2.640474 -1.559393
H  -3.049401 1.156475 -2.151805
H  -1.760743 -3.368968 -0.451458
H  -0.77443 -3.828674 -1.898551
H  0.975418 -4.395537 1.7802
H  -0.698483 -3.705232 1.776611
H  2.12975 1.509926 1.860721
H  1.884119 1.624256 -2.471492
H  4.590011 2.024446 1.733449
H  4.34566 2.165598 -2.606057
H  5.703498 2.357506 -0.495697
