program: Gaussian 09
title: 000078570
version: EM64L-G09RevD.01
frameworkgroup: C1[X(C9H10N2O)]
method: RPBEPBE
basis: SDD
operation: Freq
keyword: #p
keyword: freq=noraman
keyword: PBEPBE/SDD
title: #p freq=noraman PBEPBE/SDD
converged: YES YES NO NO
title: Mulliken charges:
elementType: O N N C C C C C C C C C H H H H H H H H H H
charge: -0.453441 -0.447951 -0.187580 0.270059 0.254214 -0.498640 0.044174 -0.311193 -0.359385 -0.348273 -0.213644 -0.224275 0.203817 0.251318 0.310502 0.184814 0.209617 0.234878 0.250472 0.226394 0.227884 0.376239
chargesum: 0.00000
title: Mulliken charges with hydrogens summed into heavy atoms:
elementType: O N N C C C C C C C C C
charge: -0.077202 -0.137450 -0.187580 0.270059 0.254214 -0.043505 0.044174 0.083239 -0.124507 -0.097801 0.012750 0.003609
polarizability: 1.66864528e+02 8.70789339e+00 1.13681377e+02 1.63782204e+00 -7.23725659e-02 5.54234921e+01
1716.lowfreq: -4.9082 -0.0004 0.0003 0.0006 9.5263 10.1473 44.1524 113.6645 135.3866
frequency: 43.9701 113.6596 135.3825 210.6270 253.4610 261.0358 323.1818 421.8452 433.1797 462.7032 540.7133 580.2576 604.2955 616.8009 643.7113 689.8444 750.7994 756.8601 771.0623 814.8547 844.1467 858.3555 889.6497 927.5989 938.1645 979.2174 989.1357 1011.3583 1026.1600 1053.6357 1111.9614 1161.8134 1167.6578 1187.0682 1210.1767 1230.8487 1266.6738 1286.7889 1321.5622 1357.0700 1377.6996 1414.3908 1430.7098 1444.8483 1450.4966 1472.3718 1476.6879 1521.3063 1597.1106 1634.8048 2944.1388 2976.5273 3032.4294 3065.3761 3132.6509 3144.6422 3159.9286 3173.4809 3243.2804 3596.3025
redmass: 5.1215 3.2057 5.8968 2.4994 4.5273 5.5136 2.9960 3.1201 3.4300 4.5617 3.4821 3.4540 1.2938 5.8824 3.6631 3.6077 1.1427 1.4348 3.0006 3.9499 2.6259 1.4921 5.3917 2.4584 1.3823 1.3070 3.5943 2.2725 4.5386 1.8953 1.6134 1.1318 1.4023 1.1212 2.6874 1.3642 3.2098 1.4946 1.6912 1.3976 2.4999 2.8198 1.2868 2.5124 1.2639 1.1776 2.8700 4.3416 6.9173 7.4066 1.0695 1.0591 1.0999 1.0951 1.0856 1.0906 1.0958 1.0994 1.0665 1.0814
irintensity: 0.5627 5.0046 2.9827 4.0367 3.8176 2.5787 0.3634 9.2394 5.7706 7.1155 0.0921 2.3113 69.2440 5.1188 17.8445 22.7473 58.3641 182.7094 35.9616 6.8507 9.9072 0.2640 2.5851 11.9853 4.6054 0.0600 8.1631 16.1945 50.2557 16.1355 5.3164 2.3313 33.8378 16.1324 3.9911 19.2349 40.6312 1.8259 12.6744 8.4516 84.4687 9.8583 67.6483 33.2812 60.0916 1.4535 0.7486 45.5262 1.7894 2.8840 85.9999 24.6750 30.2538 80.8079 0.1305 11.8401 23.8783 16.6427 320.6966 45.6689
temp: 298.150 k
press: 1.00000 atm
elementType: 8 7 7 6 6 6 6 6 6 6 6 6 1 1 1 1 1 1 1 1 1 1
symmnumber: 1
zpe: 463771.1 jmol-1
zpe.correction: 0.176641 hartree
zpe.thermalcorrener: 0.186353 hartree
zpe.thermalcorrenthalpy: 0.187297 hartree
zpe.thermalcorrgfe: 0.141057 hartree
zpe.sumelectzpe: -532.826257 hartree
zpe.sumelectthermal: -532.816544 hartree
zpe.sumelectthermalent: -532.815600 hartree
zpe.sumelectthermalfe: -532.861841 hartree
dipole: 2.4205 -5.0620 0.7036
dipole: 5.6549
quadrupole: -72.6032 -61.7508 -74.3727
quadrupole: 11.3579 -2.6781 1.0565
quadrupole: -3.0276 7.8247 -4.7971 11.3579 -2.6781 1.0565
hfenergy: -533.0028978 hartree
pointgroup: C01 [X(C9H10N2O1)]
dipole: -0.8453984 -2.0573069 0.0502164 debye
dipolederiv: -0.6994466 -0.0061577 0.1051336 -0.0713656 -0.7493055 -0.002912 0.1051514 -0.0051036 -0.5527038 -0.6594669 -0.0952597 -0.0017758 0.070859 -0.4883156 0.0498584 -0.0618458 0.0447909 -0.275988 -0.7496271 0.1352618 -0.0551572 0.0310537 -0.5313982 0.0641745 -0.0761685 0.0735164 -0.2669181 0.5786746 0.1707756 0.0240688 0.1149682 0.6787632 -0.1210341 0.1618449 -0.1417616 0.0799705 0.1769804 -0.1855709 0.0494448 -0.4815494 0.0508236 -0.036785 0.1001295 -0.0192693 0.0708788 -0.1367774 -0.1027531 0.0494639 -0.1315441 -0.0435786 0.0851955 -0.0274282 0.1361415 0.034705 0.4201674 -0.1178874 0.055483 0.1145474 -0.0693476 0.030083 0.0082936 0.0120778 0.0179228 0.4233968 -0.028871 -0.0684652 0.0881497 0.5639601 0.0939465 -0.1607727 0.0260163 0.4354462 0.0738475 0.0835062 0.0116745 0.0413983 0.0338437 -0.0408666 0.0155077 -0.0373384 -0.1763414 0.0573297 0.0270702 0.0186097 -0.0184776 0.1016182 -0.051844 0.0271272 -0.0471262 -0.1381909 -0.0285165 0.0330685 0.0081602 0.1630106 0.025037 -0.0208724 -0.0167171 -0.0360588 -0.1685957 -0.0962949 -0.0711688 0.0211274 -0.1774786 0.0082793 -0.0551157 0.0427422 -0.0435783 -0.1655697 0.0057423 -0.0110678 -0.0027045 0.0524593 -0.1616838 -0.0535359 0.0523976 -0.0748499 0.0867955 -0.0417653 0.0194176 -0.0258906 0.0161133 0.099407 -0.0089728 -0.047552 0.0315383 -0.1016314 0.178231 -0.0048559 -0.015754 -0.0141271 0.1887128 0.0272075 -0.0091654 0.0238595 0.3367156 0.0763347 -0.0200556 -0.0579223 -0.003368 -0.0372392 -0.0595864 0.0387109 -0.069974 -0.2396843 -0.2180985 0.0596675 -0.0124395 0.0204937 0.041551 -0.0065846 -0.0561127 0.0186575 0.0753975 0.06484 -0.0220797 -0.0064889 -0.0591981 -0.0872815 0.0470816 -0.0016282 0.0503401 0.1700634 0.0891263 -0.0538131 0.002642 -0.0180418 -0.0474882 0.04037 -0.005435 0.0366442 0.1580135 -0.1152952 -0.0625026 -0.014708 -0.0603782 0.0726681 0.0119458 -0.0144101 0.0123783 0.1605888 -0.0418937 0.1008817 -0.0396528 0.1029957 0.0026732 0.0417833 -0.0410885 0.0416253 0.1527749 0.6425114 0.1523941 -0.044849 0.2194798 0.3483011 -0.0335368 -0.0335807 -0.0325258 0.306351 unknown
polarizability: 166.7732|-4.5632016|110.9418155|10.2470118|-10.7100911|58.2543813 unknown
InChI: InChI=1S/C9H10N2O/c12-6-5-9-10-7-3-1-2-4-8(7)11-9/h1-4,10,12H,5-6H2
charge 0 multiplicity 1
22 atoms
O  3.389918 1.55973 0.202926
N  0.305998 -1.519612 0.358891
N  0.812036 0.662298 -0.018651
C  1.316473 -0.555864 0.26749
C  -0.925259 -0.885482 0.11497
C  2.777488 -0.840573 0.485666
C  -0.587102 0.490153 -0.122928
C  3.660554 0.203778 -0.252681
C  -2.253357 -1.354928 0.074985
C  -1.602506 1.429632 -0.407423
C  -3.254602 -0.401092 -0.210772
C  -2.934558 0.967856 -0.447637
H  3.029003 -1.86371 0.141674
H  3.005784 -0.787802 1.56904
H  0.447744 -2.507507 0.562009
H  3.501621 0.103894 -1.349199
H  4.723917 0.009132 -0.031663
H  -2.508957 -2.404239 0.255712
H  -1.352526 2.479083 -0.589221
H  -4.301773 -0.72017 -0.251019
H  -3.743507 1.673464 -0.665141
H  2.396409 1.689959 0.086473
