program: Gaussian 09
title: 000078548
version: EM64L-G09RevD.01
frameworkgroup: C1[X(C5H10O3)]
method: RPBEPBE
basis: SDD
operation: Freq
keyword: #pfreq=noraman
keyword: PBEPBE/SDD
title: #p freq=noraman PBEPBE/SDD
converged: NO YES NO NO
title: Mulliken charges:
elementType: O O O C C C C C H H H H H H H H H H
charge: -0.431547 -0.431505 -0.223122 0.167152 -0.358818 -0.704159 -0.721011 0.181342 0.247953 0.191818 0.213154 0.225384 0.245731 0.240469 0.229167 0.206160 0.340886 0.380947
chargesum: 0.00000
title: Mulliken charges with hydrogens summed into heavy atoms:
elementType: O O O C C C C C
charge: -0.090662 -0.050558 -0.223122 0.167152 0.080953 -0.019890 -0.045215 0.181342
polarizability: 6.30363286e+01 -3.96482832e+00 5.95220944e+01 -7.61039680e-01 -6.78829233e-01 6.61307769e+01
1716.lowfreq: -12.4123 0.0003 0.0007 0.0012 8.1428 12.1613 56.7174 80.3961 174.7675
frequency: 56.6504 80.2706 174.7543 202.1106 221.2348 240.6975 264.4776 316.2066 338.9288 356.5005 458.8939 491.0705 528.2266 592.0921 687.3275 732.3527 850.7738 905.9766 942.9333 956.1598 999.4431 1008.5507 1042.5853 1130.8224 1172.1549 1209.8285 1251.8276 1298.0764 1333.2414 1369.3978 1381.8048 1401.4807 1453.6038 1461.2604 1472.3759 1475.1831 1492.4103 1656.6463 2956.4638 2984.8736 2988.5030 3078.9689 3084.4079 3094.3066 3101.1670 3105.8089 3524.2313 3570.0865
redmass: 7.8506 3.4441 1.4192 1.5671 1.2283 2.9608 2.3335 1.6645 2.3062 1.8773 3.4773 3.8681 3.7190 1.2438 4.0567 5.0349 2.1795 1.9059 1.4360 2.0193 2.2528 1.6622 2.3861 1.3070 2.6504 2.5333 1.9043 2.0509 1.4629 1.1917 1.1964 1.2180 1.0617 1.0623 1.0497 1.0524 1.0663 8.7932 1.0690 1.0358 1.0366 1.0998 1.0999 1.0982 1.0994 1.0961 1.0641 1.0661
irintensity: 0.8578 2.3888 0.5075 4.7041 4.0143 0.0631 21.6133 74.9041 4.2757 82.0794 4.5665 17.5831 16.3179 135.1476 10.8966 12.4093 21.9805 7.8801 5.4452 56.7589 107.2551 7.1594 211.5801 30.7626 3.7804 2.3667 8.3160 17.1207 10.4841 1.5067 24.0461 24.8905 1.7604 2.9344 8.8880 13.2221 23.4254 234.9195 60.1374 22.7176 26.4126 14.1567 35.5055 19.7066 11.6678 24.2947 24.4695 5.7821
temp: 298.150 k
press: 1.00000 atm
elementType: 8 8 8 6 6 6 6 6 1 1 1 1 1 1 1 1 1 1
symmnumber: 1
zpe: 385778.6 jmol-1
zpe.correction: 0.146935 hartree
zpe.thermalcorrener: 0.156674 hartree
zpe.thermalcorrenthalpy: 0.157618 hartree
zpe.thermalcorrgfe: 0.112560 hartree
zpe.sumelectzpe: -421.542531 hartree
zpe.sumelectthermal: -421.532793 hartree
zpe.sumelectthermalent: -421.531849 hartree
zpe.sumelectthermalfe: -421.576907 hartree
dipole: -1.0209 2.1058 -0.8780
dipole: 2.4995
quadrupole: -43.9298 -51.0940 -51.2683
quadrupole: -3.7812 -6.2125 -0.3410
quadrupole: 4.8342 -2.3300 -2.5042 -3.7812 -6.2125 -0.3410
hfenergy: -421.6894667 hartree
pointgroup: C01 [X(C5H10O3)]
dipole: 0.4149182 0.8243084 0.3397465 debye
dipolederiv: -0.5980873 0.249219 -0.07442 0.282719 -0.6142623 -0.2317479 -0.0463906 -0.2795398 -0.3777279 -0.4596615 -0.0947721 0.3509851 -0.0795589 -0.5138888 0.3237 0.2648906 0.2870939 -0.9614345 -0.6502853 -0.1398616 -0.32729 -0.2053836 -0.3694507 -0.0595621 -0.1054859 0.0826242 -0.8566593 -0.190036 -0.0238778 -0.0727499 -0.0420338 -0.0648255 -0.0573733 -0.1701984 -0.0444989 0.0026002 0.4576737 -0.170308 -0.007538 -0.215372 0.5003816 0.1831919 0.0250541 0.203117 0.3342775 0.0034015 0.012296 0.0258674 0.0309923 0.0282119 -0.0249503 0.0492537 0.0228121 0.0082194 0.0227704 0.0338653 0.0123155 0.0290813 0.0090699 0.0308194 0.0049284 0.0265691 -0.0724927 0.9596896 0.4417994 0.1047892 0.5019312 0.4501418 -0.2161782 0.0178518 -0.2838549 1.3922614 0.0956741 0.0085077 0.0621149 0.0004081 0.0322093 0.0515911 0.0287337 0.0286711 -0.0728974 -0.1536795 -0.0998636 -0.0519961 -0.098956 -0.0886104 -0.0850291 -0.0136211 -0.0451744 0.0466004 -0.100575 -0.1327051 -0.0273155 -0.0982223 0.0147494 -0.0328664 -0.0049935 -0.0284881 0.0854522 -0.0160798 0.1272974 -0.0421198 0.104555 -0.0239588 0.0094478 -0.0677401 0.0520812 0.0569085 0.0984965 -0.0085795 0.0485236 -0.0103176 0.0729551 0.0784659 0.0522556 0.0290361 -0.094962 0.0062325 0.1193839 -0.0559767 0.0949348 -0.0095662 0.0621627 -0.0189757 0.0411268 0.0702395 0.1010365 0.013337 0.0231307 0.0230642 -0.0341383 -0.1366593 0.0392758 -0.0944372 -0.0203368 -0.1194427 -0.1152881 0.0152266 -0.0986836 0.0519349 0.0076543 -0.0379699 -0.0176434 0.072807 0.3547213 -0.113575 0.0835194 -0.1204382 0.2385121 0.1167288 0.1007088 0.0751236 0.1004782 0.1881509 -0.1068749 -0.0670665 -0.0987198 0.3205349 -0.0193952 -0.1175773 -0.0546186 0.2866662 unknown
polarizability: 62.6599381|4.1248226|59.7608135|-0.1641293|-0.1511535|66.2684483 unknown
InChI: InChI=1S/C5H10O3/c1-5(2,3-6)4(7)8/h6-7H,3H2,1-2H3
charge 0 multiplicity 1
18 atoms
O  1.633519 -1.584197 -0.237963
O  -1.42512 -0.736364 1.154525
O  -1.693794 -0.401466 -1.121043
C  0.302433 0.551001 0.031956
C  1.398821 -0.40508 0.598836
C  0.120611 1.725127 1.036917
C  0.702534 1.082976 -1.363366
C  -1.016234 -0.222637 -0.086245
H  1.075051 -0.813462 1.56826
H  2.330272 0.185099 0.740297
H  1.066331 2.291639 1.124782
H  -0.660756 2.423433 0.688351
H  -0.165179 1.354536 2.035571
H  -0.030313 1.823311 -1.725744
H  0.729499 0.275319 -2.115907
H  1.693621 1.571296 -1.313442
H  2.022488 -1.302483 -1.10367
H  -2.263683 -1.25695 1.029485
