program: Gaussian 09
title: 000078546
version: EM64L-G09RevD.01
frameworkgroup: C1[X(C7H9NO)]
method: RPBEPBE
basis: SDD
operation: Freq
keyword: #pfreq=noraman
keyword: PBEPBE/SDD
title: #p freq=noraman PBEPBE/SDD
converged: NO YES NO NO
title: Mulliken charges:
elementType: O N C C C C C C C H H H H H H H H H
charge: -0.358388 -0.027167 -0.474364 0.379965 -0.340709 -0.676725 -0.255197 -0.212497 -0.168125 0.246001 0.203664 0.239459 0.208721 0.220264 0.259200 0.278423 0.243773 0.233700
chargesum: 0.00000
title: Mulliken charges with hydrogens summed into heavy atoms:
elementType: O N C C C C C C C
charge: -0.358388 -0.027167 -0.024699 0.379965 -0.101249 0.011460 0.023226 0.031276 0.065576
polarizability: 1.13379917e+02 -8.22410305e+00 9.66005908e+01 6.79709103e+00 1.07049015e+00 4.69384262e+01
1716.lowfreq: -17.4884 -14.6362 -6.3653 -0.0007 0.0004 0.0006 91.6586 118.8075 205.6729
frequency: 91.6257 118.8069 205.6687 209.3140 316.9215 338.8435 444.2276 478.6635 530.5357 557.2790 589.3253 720.4912 734.6166 760.2074 773.0295 840.3829 851.4653 932.5500 966.2949 972.2466 1028.2543 1050.4034 1065.0536 1109.9644 1156.4679 1217.3297 1226.6993 1242.5682 1262.8441 1317.6431 1322.8574 1378.0758 1410.7907 1450.6506 1469.9176 1485.7390 1495.2464 1540.0845 1619.3364 2989.1388 3001.5010 3062.1062 3085.3737 3106.2652 3149.1079 3160.2570 3181.2361 3210.6400
redmass: 2.5737 3.4787 3.2796 1.2515 2.6812 2.8988 4.5104 3.4809 4.4075 4.5938 4.9192 3.1623 2.9573 1.5316 1.3455 3.7910 1.4006 1.3622 1.3199 2.4965 1.9837 2.0094 1.7451 1.5990 1.0983 2.2796 3.5612 1.6490 2.3726 1.6258 1.4474 1.2037 1.8777 1.1411 1.0979 2.2242 1.1418 6.7347 6.1873 1.0349 1.0590 1.1013 1.1007 1.1011 1.0881 1.0908 1.0983 1.0969
irintensity: 1.8162 2.7338 2.3528 0.4348 2.7040 2.5686 6.1068 7.2585 1.3896 2.0498 1.4291 7.8639 4.4214 81.0164 13.6795 16.6853 1.9754 3.5356 0.0793 10.9097 1.8541 20.8612 10.1394 15.2812 1.3181 13.0037 63.5016 13.1881 4.3517 2.4840 1.6946 18.5987 42.1846 12.0278 12.6010 11.1921 20.6949 0.9096 5.4380 41.5998 23.8168 7.6058 38.3637 17.4484 2.9965 11.0390 9.8443 0.9231
temp: 298.150 k
press: 1.00000 atm
elementType: 8 7 6 6 6 6 6 6 6 1 1 1 1 1 1 1 1 1
symmnumber: 1
zpe: 384169.0 jmol-1
zpe.correction: 0.146322 hartree
zpe.thermalcorrener: 0.154442 hartree
zpe.thermalcorrenthalpy: 0.155386 hartree
zpe.thermalcorrgfe: 0.113590 hartree
zpe.sumelectzpe: -401.400844 hartree
zpe.sumelectthermal: -401.392724 hartree
zpe.sumelectthermalent: -401.391780 hartree
zpe.sumelectthermalfe: -401.433576 hartree
dipole: 1.9972 -3.0232 0.2654
dipole: 3.6330
quadrupole: -46.5582 -54.6714 -55.8533
quadrupole: 4.3417 1.5873 1.5531
quadrupole: 5.8027 -2.3104 -3.4923 4.3417 1.5873 1.5531
hfenergy: -401.5471658 hartree
pointgroup: C01 [X(C7H9N1O1)]
dipole: -0.7426988 1.2204535 -0.0437851 debye
dipolederiv: -0.6389007 0.3004504 -0.0096298 0.3652493 -0.8215004 0.0038797 -0.031807 0.0082952 -0.328742 0.3105222 -0.4262002 0.0328888 -0.5861554 0.6402377 0.0086568 0.0727457 -0.0136586 0.1112376 -0.0961109 0.0182696 -0.0180745 0.1088685 0.1447249 -0.0277151 -0.1209759 -0.0582538 0.0758003 0.4687304 0.0299377 -0.0474431 0.2570379 -0.2509252 -0.0010007 -0.1354896 0.0501109 -0.0699539 -0.0133994 -0.0420434 -0.0336261 -0.0153503 0.1374084 -0.0326866 -0.0174578 -0.035748 -0.1020671 0.0058144 -0.0201464 -0.0336322 -0.0602536 0.0349236 0.0282932 0.0842153 0.0760611 0.0107874 -0.1490873 0.2314973 -0.0404968 -0.0241288 0.0721129 -0.0272084 0.0089697 -0.0722486 -0.1362003 -0.1317288 -0.0240516 -0.0096206 -0.0691578 -0.0554232 -0.0105216 0.0059035 -0.0158065 -0.1742654 0.0831427 -0.0373703 -0.0372207 0.0553262 0.0612408 -0.037273 -0.0411426 -0.0257393 -0.099681 0.0483474 -0.010735 0.018173 0.0477038 0.0174286 -0.1163136 0.0164286 -0.0464321 -0.0037732 0.0346155 0.0060458 -0.01717 -0.0621294 -0.0849678 0.1372527 0.0010184 0.0866229 0.0154884 0.0724221 -0.0826447 0.0325727 -0.0646009 -0.0388592 0.0407991 0.0263894 0.0451824 0.1347774 0.067022 0.0788801 0.0373194 0.0194016 -0.0395289 -0.1358467 -0.0089314 -0.0947267 -0.0395192 -0.2289077 -0.0347436 0.0241545 -0.034411 0.1125323 -0.0012292 0.0197737 -0.0071713 0.061562 0.1573955 -0.0501212 0.027879 0.0294781 -0.0356485 0.106727 0.036933 0.0427065 0.0447489 0.0714043 0.0135999 0.0165518 -0.0249295 0.0185209 0.0308785 0.0227647 0.0266334 0.1764835 0.0132805 0.0856537 0.0118423 0.0929047 -0.0135265 0.0172087 0.0140399 0.0181513 0.1710535 -0.0745622 -0.0362779 0.0455323 -0.0348535 0.1012496 0.0160994 0.0466223 0.0160211 0.1522631 unknown
polarizability: 112.9153425|-9.4308886|96.3687933|-4.9544263|-6.5951182|47.6347978 unknown
InChI: InChI=1S/C7H9NO/c1-2-7-5-3-4-6-8(7)9/h3-6H,2H2,1H3
charge 0 multiplicity 1
18 atoms
O  0.795425 -1.924683 0.043581
N  -0.032431 -0.873182 0.010203
C  1.943958 0.514076 -0.548317
C  0.463037 0.410799 -0.290878
C  -0.434013 1.49368 -0.315162
C  2.787249 0.414366 0.753244
C  -1.388277 -1.050618 0.272573
C  -1.81159 1.327947 -0.0457
C  -2.280284 0.026489 0.25095
H  2.243237 -0.312557 -1.219232
H  2.147432 1.47222 -1.059598
H  -0.027943 2.482037 -0.553081
H  2.518741 1.215187 1.465366
H  3.862327 0.507934 0.517535
H  2.621664 -0.564467 1.233179
H  -1.668175 -2.082192 0.489843
H  -2.494397 2.181361 -0.067732
H  -3.335758 -0.164697 0.465726
