program: Gaussian 09
title: 000078580
version: EM64L-G09RevD.01
frameworkgroup: C1[X(C6H12N4O3)]
method: RPBEPBE
basis: SDD
operation: Freq
keyword: #p
keyword: freq=noraman
keyword: PBEPBE/SDD
title: #p freq=noraman PBEPBE/SDD
converged: YES YES NO NO
title: Mulliken charges:
elementType: O O O N N N N C C C C C C H H H H H H H H H H H H
charge: -0.335352 -0.335084 -0.335546 -0.058305 -0.594097 -0.593876 -0.593417 -0.487383 -0.487422 -0.486747 0.249571 0.249671 0.249775 0.244444 0.238921 0.244337 0.238615 0.244401 0.238288 0.320570 0.382678 0.320748 0.382358 0.320561 0.382291
chargesum: 0.00000
title: Mulliken charges with hydrogens summed into heavy atoms:
elementType: O O O N N N N C C C C C C
charge: -0.335352 -0.335084 -0.335546 -0.058305 0.109151 0.109230 0.109435 -0.004018 -0.004469 -0.004058 0.249571 0.249671 0.249775
polarizability: 1.04561285e+02 -2.97901244e-02 1.04378714e+02 1.42733345e-02 1.36422636e-03 9.07959797e+01
1716.lowfreq: -9.2582 -0.0005 -0.0001 0.0003 7.7080 14.7751 59.2598 60.8191 82.2592
frequency: 59.2321 60.7844 82.2008 106.9030 151.9721 157.6569 161.3763 197.1456 199.2933 312.4360 320.9594 321.4548 406.1134 435.4747 435.9067 500.0214 515.4331 516.7921 603.3496 629.2533 632.5617 696.1778 719.0123 720.7192 748.9212 752.3492 778.9818 845.8556 850.1072 850.6551 860.4872 933.2222 974.9389 976.5296 1101.2966 1103.1128 1109.5346 1146.5829 1148.5706 1213.1508 1322.2878 1323.6324 1345.4699 1346.2385 1346.7895 1380.0196 1387.8186 1388.6834 1436.0632 1437.2788 1438.7945 1563.8436 1606.5342 1607.1097 1643.0361 1644.6722 1647.5301 2985.0072 2986.0743 2989.0723 3064.1979 3068.5558 3069.1454 3350.1863 3367.8928 3370.2477 3591.3295 3591.6644 3592.4213
redmass: 6.2082 6.2595 3.9730 4.6544 8.3791 6.2821 6.3543 5.2873 5.3568 6.3763 4.7756 4.8082 2.3272 1.7684 1.7701 3.3369 2.9716 2.9872 2.1356 1.3393 1.3627 1.5303 2.6641 2.7928 1.1789 1.1898 1.2312 4.5204 5.2855 5.3224 5.0567 1.7335 2.0706 2.0705 1.8757 1.8682 1.7278 1.9427 1.9537 1.1136 1.6827 1.6622 1.5411 1.3928 1.5050 3.3795 2.3391 2.3011 1.0884 1.0804 1.0792 3.2919 2.3066 2.3560 1.7176 1.6563 1.4795 1.0605 1.0602 1.0627 1.1021 1.1023 1.1024 1.0565 1.0587 1.0586 1.0939 1.0939 1.0935
irintensity: 4.2581 4.3346 18.4834 1.9895 1.6282 21.8907 19.8325 21.9226 20.5721 23.0100 3.9017 4.2923 6.7164 8.0428 7.6501 27.4702 2.1642 2.1717 19.8815 67.2034 70.4517 0.1662 77.5922 72.8542 475.0497 477.0843 25.9001 3.7102 4.1462 4.0115 5.1619 0.2414 8.7574 8.7853 18.4107 19.4014 0.4342 58.8538 57.6885 9.4039 1.0121 1.0863 6.5141 5.3474 6.5907 130.2516 11.4921 10.7437 22.3962 19.7677 19.9388 24.1963 197.9904 206.9998 238.2167 217.9430 156.6070 39.0853 38.6364 54.1057 0.2442 19.5896 19.7632 4.3720 268.8390 265.7011 48.4912 49.2318 51.6971
temp: 298.150 k
press: 1.00000 atm
elementType: 8 8 8 7 7 7 7 6 6 6 6 6 6 1 1 1 1 1 1 1 1 1 1 1 1
symmnumber: 1
zpe: 527721.4 jmol-1
zpe.correction: 0.200998 hartree
zpe.thermalcorrener: 0.214338 hartree
zpe.thermalcorrenthalpy: 0.215283 hartree
zpe.thermalcorrgfe: 0.161260 hartree
zpe.sumelectzpe: -679.542079 hartree
zpe.sumelectthermal: -679.528739 hartree
zpe.sumelectthermalent: -679.527794 hartree
zpe.sumelectthermalfe: -679.581817 hartree
dipole: -0.0004 0.0191 -0.5943
dipole: 0.5946
quadrupole: -84.5285 -84.5369 -65.5244
quadrupole: 0.0202 -0.0634 0.0174
quadrupole: -6.3319 -6.3403 12.6722 0.0202 -0.0634 0.0174
hfenergy: -679.743077 hartree
pointgroup: C01 [X(C6H12N4O3)]
dipole: 0.0075937 0.0005696 0.2338219 debye
dipolederiv: -0.5676965 -0.0490588 0.0626888 -0.1232942 -1.1135655 0.0265532 0.0521091 -0.2210519 -0.5472788 -0.9013333 0.3179347 -0.0069527 0.2431776 -0.7806097 -0.0700834 -0.2157835 0.063428 -0.5461008 -1.0540198 -0.1551781 -0.0548426 -0.2287886 -0.6301101 0.0411179 0.1655363 0.1549155 -0.5459531 -0.4875565 0.0944267 -0.0000903 -0.0949418 -0.4880779 0.0005831 -0.0004041 0.0005568 -0.6900451 -0.8035381 -0.2397725 0.1127974 -0.1635536 -0.7606402 0.2190809 0.1818598 0.3637301 -0.5055287 -0.5938113 0.0412945 0.1338851 0.1181286 -0.9675318 -0.2085028 0.2236199 -0.340538 -0.5074364 -0.9472497 0.0855709 -0.2459102 0.1632156 -0.6193099 -0.0111562 -0.4046489 -0.0227161 -0.5034323 0.4956293 -0.1298395 0.0948809 -0.093012 0.0778048 -0.0825051 0.0264811 -0.0739451 0.1893262 0.2777458 0.2188201 -0.1173476 0.2544639 0.2950942 -0.0422181 -0.0764685 0.0132368 0.1897857 0.0865238 -0.1431011 0.0217421 -0.1072963 0.4855841 0.1268057 0.0495847 0.062806 0.1911176 0.2458065 0.2788261 -0.3002971 0.3804656 1.3560273 -0.1745246 -0.3772055 -0.1033953 0.7220892 0.7894355 -0.6957678 -0.0018178 -0.5934325 0.811507 0.3505194 0.0987802 0.3814825 0.7223883 1.3676839 0.2586907 0.3023322 0.3611089 0.2401484 -0.1786185 0.2803278 -0.2817507 0.7170417 0.0329489 0.0506101 -0.0063431 0.1354311 -0.0556583 0.1297794 -0.0285596 0.0652957 -0.0140043 0.0075251 -0.0646429 -0.0057191 -0.1156317 -0.0359185 -0.0926762 0.0375848 -0.0448325 0.0632812 -0.1126013 -0.0509099 0.1152732 0.0340209 0.0916474 -0.0594522 0.071488 -0.0071994 -0.0153045 0.0521764 0.0897035 -0.0767173 0.0389817 -0.0824982 0.0507647 -0.0572513 -0.0116666 0.0642497 0.0471485 -0.1259881 -0.1103064 -0.0419972 -0.068165 -0.0708886 -0.0425849 -0.058322 -0.0151851 -0.1040577 0.0510509 0.0837049 0.0005639 0.0738303 0.0411772 0.0195913 0.0548243 0.0643016 0.3764836 -0.0110025 0.0104536 0.0015491 0.158297 -0.0196534 0.0618856 -0.0459974 0.1293466 0.529074 -0.0467213 -0.0103392 -0.1709189 0.3830356 -0.0047771 -0.0069959 0.0517165 0.1931553 0.2178002 0.0909549 -0.0224313 0.1032901 0.3174523 0.0001582 -0.0711902 -0.0307222 0.1302328 0.5120594 0.1798281 -0.0009119 0.0558986 0.3978094 0.0120195 0.0454995 -0.0206364 0.1919176 0.208352 -0.0976416 0.0116098 -0.0860624 0.3269054 0.0191397 0.0084255 0.0778056 0.129962 0.3254711 0.0519129 0.0106585 -0.0713664 0.586942 -0.0026426 -0.0416814 -0.0270243 0.1920736 unknown
polarizability: 104.4090493|-0.0741331|104.5306078|-0.0177068|0.0678834|90.7963224 unknown
InChI: InChI=1S/C6H12N4O3/c7-4(11)1-10(2-5(8)12)3-6(9)13/h1-3,7-9H2
charge 0 multiplicity 1
25 atoms
O  -1.731595 2.051015 0.116549
O  2.634752 0.479102 0.108662
O  -0.906657 -2.516216 0.0952
N  -0.002588 0.011614 -1.737946
N  -2.350715 -0.125338 0.667944
N  1.067128 2.108294 0.668471
N  1.291078 -1.976924 0.647345
C  -1.43452 0.312764 -1.602359
C  0.975342 1.100361 -1.602478
C  0.452503 -1.380696 -1.61598
C  -1.863242 0.816725 -0.199146
C  1.633155 1.214388 -0.201698
C  0.230024 -2.016179 -0.218487
H  -1.707493 1.122787 -2.306015
H  -2.000124 -0.595835 -1.874458
H  1.809729 0.934905 -2.311107
H  0.469884 2.045889 -1.866952
H  -0.112033 -2.015215 -2.326178
H  1.522502 -1.413933 -1.886724
H  -2.607645 0.170225 1.611525
H  -2.231676 -1.129879 0.467274
H  1.455033 2.182278 1.610655
H  0.138273 2.509913 0.470322
H  1.163089 -2.350798 1.58944
H  2.102795 -1.372247 0.449039
