program: Gaussian 09
title: 000078566
version: EM64L-G09RevD.01
frameworkgroup: C1[X(C10H13N3O2)]
method: RPBEPBE
basis: SDD
operation: Freq
keyword: #p
keyword: freq=noraman
keyword: PBEPBE/SDD
title: #p freq=noraman PBEPBE/SDD
converged: NO YES NO NO
title: Mulliken charges:
elementType: O O N N N C C C C C C C C C C H H H H H H H H H H H H H
charge: -0.281945 -0.276272 -0.251839 -0.213076 -0.658407 0.255685 0.462776 -0.474400 -0.429066 0.223775 -0.472492 -0.038422 -0.027299 -0.588129 -0.559339 0.286986 0.245526 0.254263 0.235418 0.240010 0.254280 0.249254 0.344129 0.325628 0.229564 0.226510 0.212410 0.224473
chargesum: 0.00000
title: Mulliken charges with hydrogens summed into heavy atoms:
elementType: O O N N N C C C C C C C C C C
charge: -0.281945 -0.276272 -0.251839 -0.213076 0.011350 0.255685 0.462776 0.058112 0.060615 0.223775 -0.232482 0.215857 0.221955 -0.132055 -0.122456
polarizability: 1.89424827e+02 -9.19938041e-01 1.41453300e+02 -7.66505998e-02 3.32684427e+00 8.48849923e+01
1716.lowfreq: -7.7952 -3.5645 -0.0003 0.0004 0.0008 5.3572 35.6442 46.4558 62.0517
frequency: 35.5991 46.3214 62.0375 80.2967 96.8196 101.5891 161.9065 184.0264 195.7517 277.8360 308.0038 314.1576 345.2262 361.8134 390.2983 400.8905 420.1071 451.1355 470.6770 515.3555 529.3689 596.8121 613.8957 632.9580 647.0530 672.1101 686.2873 720.2693 769.5882 787.0048 845.4959 903.9274 910.6405 931.4273 953.5247 958.7416 982.5565 1011.0184 1013.2581 1044.1350 1069.7325 1105.1534 1150.6788 1158.8825 1184.7325 1201.1873 1262.6831 1279.5459 1281.4762 1291.1890 1314.6420 1332.3882 1339.4277 1363.6171 1425.1776 1427.1864 1440.6677 1449.3354 1487.7561 1568.6145 1624.4610 1640.7701 1647.8179 1658.6844 1661.2857 2992.5485 3033.0413 3053.4710 3086.9052 3090.0062 3105.8040 3114.0003 3122.7359 3196.1132 3199.9209 3201.6235 3508.7746 3667.0237
redmass: 3.8908 3.8555 5.5699 2.9286 3.8222 2.6952 4.0857 3.8784 3.6470 3.0455 3.7410 3.9562 3.4817 3.6668 2.7904 2.3422 4.0536 1.3172 2.5021 2.6099 1.1956 3.6818 2.3000 2.8626 3.8998 3.2393 3.5625 5.8191 3.0935 2.0882 2.3263 1.8649 1.5556 2.2049 1.3473 1.3387 2.2758 1.1379 1.2091 1.9209 2.9865 1.7663 2.4733 2.4485 5.5592 2.6995 1.7013 1.3564 1.3291 1.5759 1.5911 1.6713 1.2849 1.8241 1.1641 1.1935 1.1404 1.1865 3.2650 7.3914 2.6658 2.3841 3.9045 4.0678 4.6800 1.0584 1.0606 1.1025 1.0614 1.0599 1.0985 1.0941 1.0984 1.0928 1.1148 1.1134 1.0492 1.1005
irintensity: 0.6152 1.9621 1.5991 0.7893 5.8674 0.3434 1.6702 0.3698 1.4416 1.9374 3.7050 5.2488 17.6753 13.4974 9.2735 0.7080 5.8878 7.6488 17.0390 11.0022 254.7421 21.0681 3.7019 6.4087 0.4472 15.3698 12.4990 6.9210 7.4342 77.9077 13.3028 33.1955 10.1022 8.7257 72.9164 74.9892 6.8676 31.3967 12.7640 7.3404 4.5205 3.9832 17.4425 5.6622 46.0060 12.5877 131.6285 10.4214 3.1608 26.6531 58.5041 32.6606 1.0619 81.3247 18.7449 4.9432 54.7797 28.3351 250.7661 120.2943 236.1631 139.3667 3.1475 723.6185 147.4690 43.9483 16.3212 16.4483 7.2027 7.5887 1.5782 5.1235 6.3242 2.9560 23.5124 17.1116 140.0763 73.8464
temp: 298.150 k
press: 1.00000 atm
elementType: 8 8 7 7 7 6 6 6 6 6 6 6 6 6 6 1 1 1 1 1 1 1 1 1 1 1 1 1
symmnumber: 1
zpe: 581199.6 jmol-1
zpe.correction: 0.221367 hartree
zpe.thermalcorrener: 0.236379 hartree
zpe.thermalcorrenthalpy: 0.237324 hartree
zpe.thermalcorrgfe: 0.178509 hartree
zpe.sumelectzpe: -702.439741 hartree
zpe.sumelectthermal: -702.424728 hartree
zpe.sumelectthermalent: -702.423784 hartree
zpe.sumelectthermalfe: -702.482599 hartree
dipole: 6.7123 0.0371 1.0376
dipole: 6.7921
quadrupole: -77.7871 -95.1407 -87.2353
quadrupole: 12.1797 2.0990 -1.1598
quadrupole: 8.9339 -8.4197 -0.5142 12.1797 2.0990 -1.1598
hfenergy: -702.6611078 hartree
pointgroup: C01 [X(C10H13N3O2)]
dipole: -2.6296188 0.0353242 0.4739341 debye
polarizability: 189.3429535|-1.5324906|140.8400646|-2.5134421|-6.7874774|85.5801005 unknown
InChI: InChI=1S/C10H13N3O2/c1-3-5-12-8(11)7-9(14)13(6-4-2)10(12)15/h3-4,7H,1-2,5-6,11H2
charge 0 multiplicity 1
28 atoms
O  0.331757 1.773653 -1.043223
O  2.26479 -2.320198 0.198946
N  -1.076693 0.049864 -0.306492
N  1.298314 -0.266928 -0.40822
N  -2.533228 -1.68009 0.422849
C  0.215918 0.590145 -0.607492
C  -1.238256 -1.260609 0.17008
C  -2.243045 0.91202 -0.632687
C  2.665667 0.274953 -0.667548
C  1.203349 -1.638396 0.058091
C  -0.134274 -2.087366 0.343342
C  -3.041423 1.346582 0.582344
C  3.295196 0.835838 0.593877
C  -4.397595 1.329456 0.648743
C  3.634018 2.138031 0.755925
H  -1.801997 1.80435 -1.115154
H  -2.888379 0.39876 -1.369972
H  3.264812 -0.573384 -1.041852
H  2.577228 1.052244 -1.442056
H  -0.249413 -3.098805 0.735219
H  -2.449904 1.733425 1.424193
H  3.485567 0.104187 1.391292
H  -3.280862 -1.006551 0.59191
H  -2.66952 -2.638075 0.735377
H  -4.93133 1.709218 1.525914
H  -5.012374 0.967774 -0.186462
H  4.106616 2.496659 1.677551
H  3.44236 2.881244 -0.027496
