program: Gaussian 09
title: 000081556
version: EM64L-G09RevD.01
frameworkgroup: C1[X(C16H20Cl2N6)]
method: RPBEPBE
basis: SDD
operation: Freq
keyword: #p
keyword: freq=noraman
keyword: PBEPBE/SDD
title: #p freq=noraman PBEPBE/SDD
converged: YES YES NO NO
title: Mulliken charges:
elementType: Cl Cl N N N N N N C C C C C C C C C C C C C C C C H H H H H H H H H H H H H H H H H H H H
charge: -0.030070 -0.030070 -0.112888 -0.112908 0.005564 0.005517 -0.010421 -0.010387 -0.424842 -0.401796 -0.424796 -0.401808 -0.376485 -0.379186 -0.376499 -0.379159 -0.404038 -0.404041 0.204300 0.204357 0.077957 0.077977 -0.434021 -0.434000 0.204562 0.321092 0.287415 0.209431 0.204554 0.321104 0.287464 0.209428 0.209246 0.214623 0.216903 0.207331 0.209241 0.214621 0.216859 0.207332 0.223925 0.191343 0.223924 0.191346
chargesum: 0.00000
title: Mulliken charges with hydrogens summed into heavy atoms:
elementType: Cl Cl N N N N N N C C C C C C C C C C C C C C C C
charge: -0.030070 -0.030070 -0.112888 -0.112908 0.005564 0.005517 -0.010421 -0.010387 0.100811 0.095050 0.100861 0.095084 0.047384 0.045048 0.047362 0.045031 0.011230 0.011229 0.204300 0.204357 0.077957 0.077977 -0.434021 -0.434000
polarizability: 3.66956652e+02 -1.42951893e+01 2.85831975e+02 4.30008647e-03 9.41104234e-04 1.34982784e+02
1716.lowfreq: -7.4572 -5.8954 -1.9443 -0.0018 -0.0011 -0.0008 8.6719 26.6446 30.5031
frequency: 8.4824 26.3405 30.4576 44.4478 44.8970 101.5521 112.0305 117.9666 130.5048 151.3661 157.9675 179.6298 186.1460 213.4005 232.1845 267.8537 279.1279 306.7598 345.8755 348.9109 375.6660 394.1241 399.1690 420.1399 429.8285 431.7727 441.5044 455.2001 490.2744 493.9103 531.8332 557.9026 581.8816 591.7570 638.6106 645.4643 662.3343 710.4739 719.8363 739.2470 799.2483 802.2805 802.4970 812.2104 829.0813 849.3623 849.7715 853.5533 854.1925 893.5502 905.7991 929.4971 948.2124 948.4649 977.7063 1008.5567 1022.8307 1036.8054 1063.6348 1071.9078 1075.2518 1102.8512 1105.6232 1127.0862 1136.5736 1149.9707 1152.9443 1157.0562 1167.1177 1210.8624 1230.7726 1250.0255 1250.6724 1255.9633 1264.7629 1275.4146 1280.3116 1285.3373 1285.5020 1330.8387 1330.9209 1333.6950 1333.9377 1340.2000 1340.3560 1346.2750 1348.0109 1353.1682 1371.3845 1378.9488 1408.5422 1435.6233 1454.6893 1455.0954 1461.0827 1462.2310 1462.5214 1464.5764 1468.7005 1470.1454 1473.4726 1477.1216 1482.0719 1494.3604 1534.9896 1537.0319 2964.7302 2965.1035 2969.4031 2969.4815 2977.2625 2977.6885 2988.3405 2988.3685 2990.1245 2990.1404 3037.6959 3037.8892 3049.3535 3049.3651 3057.5663 3057.7676 3101.9420 3102.1224 3118.1481 3118.2072
redmass: 5.3557 3.3498 4.0009 5.2652 3.8564 3.8218 8.0537 4.7855 9.7961 8.2388 10.0081 9.3247 3.6042 3.0170 2.8730 2.0008 3.5205 4.9784 2.9764 3.2713 4.8956 4.5168 7.4009 2.2652 2.3805 6.2092 2.9517 3.0356 3.0068 2.6725 6.4045 4.6282 2.7482 2.7106 11.6248 8.2249 12.1599 9.3065 11.6541 5.2630 3.9549 1.5728 1.5058 12.0694 3.8325 1.4532 1.5015 4.4717 3.7280 3.0482 2.6784 3.7200 1.3175 1.3254 2.8294 2.4596 2.3723 2.1786 2.4559 2.1006 1.7850 2.7187 2.8603 3.1213 2.1620 1.3812 1.3467 2.3078 2.2391 2.5976 2.5181 1.3532 1.3348 3.0998 1.9252 2.6024 1.4318 1.4215 1.3838 1.3035 1.3045 1.3540 1.3655 1.4960 1.4547 1.7323 1.4464 2.0310 1.4842 1.7944 5.1286 7.4034 1.1034 1.0940 1.3121 1.0886 1.1339 1.1309 1.2565 1.0883 2.1549 1.3216 1.1486 6.3847 4.5293 4.1151 1.0686 1.0687 1.0639 1.0640 1.0696 1.0698 1.0616 1.0617 1.0611 1.0612 1.0961 1.0960 1.1023 1.1023 1.1031 1.1031 1.0970 1.0970 1.0938 1.0938
irintensity: 2.1825 0.0923 0.1084 0.2204 0.0498 2.6888 0.3166 0.0324 0.0188 2.0130 0.4487 0.6415 0.0476 5.7479 0.0138 1.7273 0.7396 1.2883 0.0122 8.4614 4.9270 0.7564 0.0698 5.8869 5.7791 20.4608 2.8238 3.0730 0.1450 17.9470 0.9769 0.7627 1.6744 0.3803 0.0204 8.8994 0.2929 0.0331 6.8381 9.5296 0.0566 0.0006 0.0459 0.0122 44.4324 12.2917 26.4489 99.3195 3.7221 0.0310 7.0785 0.5004 18.0222 0.0796 227.2759 6.7720 11.3214 0.0269 100.5521 148.1535 0.7038 78.7096 0.1899 118.2109 1.5448 0.0336 7.6708 31.6831 0.0533 10.5948 0.3733 2.2310 10.9342 83.0123 0.0856 1.6455 9.7254 0.0726 156.3710 11.4628 0.0094 8.5683 0.0984 0.7939 5.5228 0.0195 38.1366 0.0156 100.8027 0.0614 622.4961 381.2631 0.0129 8.6646 11.2422 25.2418 28.0678 92.2112 5.6777 3.5059 0.1536 18.2625 59.5645 0.0048 1196.5884 0.8905 73.8274 18.7658 97.4434 1.9747 110.1038 41.6556 25.3915 27.1381 39.0516 21.6413 81.6336 48.6087 7.4992 39.3871 112.2779 87.4169 7.8022 103.3139 8.6465 3.9387
temp: 298.150 k
press: 1.00000 atm
elementType: 17 17 7 7 7 7 7 7 6 6 6 6 6 6 6 6 6 6 6 6 6 6 6 6 1 1 1 1 1 1 1 1 1 1 1 1 1 1 1 1 1 1 1 1
symmnumber: 1
zpe: 920411.5 jmol-1
zpe.correction: 0.350566 hartree
zpe.thermalcorrener: 0.371994 hartree
zpe.thermalcorrenthalpy: 0.372938 hartree
zpe.thermalcorrgfe: 0.297070 hartree
zpe.sumelectzpe: -1868.569791 hartree
zpe.sumelectthermal: -1868.548364 hartree
zpe.sumelectthermalent: -1868.547420 hartree
zpe.sumelectthermalfe: -1868.623288 hartree
dipole: -0.0001 -0.0006 0.8339
dipole: 0.8339
quadrupole: -116.6761 -178.5562 -153.7175
quadrupole: -5.0803 -0.0006 0.0032
quadrupole: 32.9739 -28.9063 -4.0676 -5.0803 -0.0006 0.0032
hfenergy: -1868.9203576 hartree
pointgroup: C01 [X(C16H20Cl2N6)]
dipole: -0.0000311 -0.0000662 0.3280718 debye
polarizability: 368.2868975|-9.7297003|284.5016948|0.007926|-0.0714627|134.9828186 unknown
InChI: InChI=1S/C16H20Cl2N6/c17-15-20-12-11(13(21-15)23-7-3-1-4-8-23)19-16(18)22-14(12)24-9-5-2-6-10-24/h1-10H2
charge 0 multiplicity 1
44 atoms
Cl -0.055661 -4.206516 -0.544893
Cl 0.049266 4.208453 -0.549144
N  -3.132859 -0.259571 -0.593782
N  3.126455 0.261446 -0.593325
N  -1.558667 -1.978358 -0.560729
N  1.552261 1.980279 -0.562607
N  0.838249 -1.672346 -0.563098
N  -0.844657 1.674268 -0.564832
C  -3.689426 1.121696 -0.540934
C  -4.199159 -1.303043 -0.575786
C  3.682888 -1.119874 -0.540624
C  4.192805 1.304874 -0.575701
C  -4.534716 1.308723 0.742412
C  -5.047804 -1.181154 0.710911
C  4.528809 -1.306963 0.742272
C  5.042077 1.182817 0.710548
C  -5.644707 0.238566 0.851274
C  5.638974 -0.236932 0.850552
C  -1.811395 -0.624116 -0.57138
C  1.804996 0.626023 -0.571836
C  0.652626 -0.297179 -0.567014
C  -0.659039 0.299104 -0.567335
C  -0.285564 -2.390939 -0.5591
C  0.279168 2.392862 -0.561492
H  -4.338899 1.246699 -1.432372
H  -2.865945 1.844721 -0.591522
H  -3.722311 -2.288926 -0.65675
H  -4.84034 -1.136209 -1.465494
H  4.331879 -1.245059 -1.432404
H  2.859289 -1.842802 -0.590729
H  3.715922 2.290769 -0.656356
H  4.83356 1.13819 -1.465755
H  -4.971227 2.325403 0.727488
H  -3.865248 1.254049 1.623052
H  -4.408744 -1.413369 1.584805
H  -5.8504 -1.942391 0.680605
H  4.965183 -2.323696 0.727139
H  3.859808 -1.25219 1.62326
H  4.403483 1.415001 1.584792
H  5.844684 1.944029 0.679869
H  -6.184825 0.337441 1.811532
H  -6.390009 0.401778 0.04515
H  6.1796 -0.335866 1.810516
H  6.383824 -0.400193 0.044019
