program: Gaussian 09
title: 000078539
version: EM64L-G09RevD.01
frameworkgroup: C1[X(C7H16O3)]
method: RPBEPBE
basis: SDD
operation: Freq
keyword: #pfreq=noraman
keyword: PBEPBE/SDD
title: #p freq=noraman PBEPBE/SDD
converged: YES YES NO NO
title: Mulliken charges:
elementType: O O O C C C C C C C H H H H H H H H H H H H H H H H
charge: -0.240151 -0.287815 -0.266401 -0.010621 -0.328049 -0.223463 -0.202646 -0.688537 -0.682302 -0.492482 0.214095 0.214413 0.216404 0.207039 0.214848 0.216763 0.191271 0.200767 0.232043 0.220280 0.204603 0.225449 0.225259 0.203366 0.199333 0.236537
chargesum: 0.00000
title: Mulliken charges with hydrogens summed into heavy atoms:
elementType: O O O C C C C C C C
charge: -0.240151 -0.287815 -0.266401 0.203474 0.102767 0.198423 0.205387 -0.035447 -0.026991 0.146754
polarizability: 1.04034515e+02 1.52629234e+00 9.04838518e+01 4.56212396e-01 1.51167728e+00 7.33429988e+01
1716.lowfreq: -6.7204 0.0007 0.0012 0.0014 6.3862 11.5242 44.4894 49.9660 71.7486
frequency: 44.4758 49.8893 71.6086 83.8363 97.0708 106.4117 148.8138 193.6703 231.2117 231.9832 239.6487 246.2083 307.2460 326.3425 357.2721 432.6822 576.5221 628.6777 772.2499 811.6468 823.8485 829.6086 898.8699 914.5786 959.6388 1025.2928 1043.2858 1066.0319 1075.6956 1099.7664 1112.0022 1118.7320 1133.1169 1138.1503 1140.1996 1162.7860 1207.0656 1247.0772 1258.2633 1277.6078 1351.8885 1362.1293 1368.9478 1385.4621 1394.5186 1397.3334 1437.2982 1455.8975 1459.7356 1459.9812 1466.7960 1478.3417 1481.3983 1484.9555 1493.5479 1495.7833 2921.7109 2944.6084 2945.5325 2962.7333 2989.2225 2990.8007 2992.0013 2995.2553 3011.9447 3018.3363 3021.4834 3087.6002 3089.2112 3098.2312 3099.0574 3104.4852
redmass: 3.1140 2.8560 2.0631 2.1856 1.8703 2.7357 2.7814 1.8048 2.3328 1.3660 1.6997 1.2766 3.3614 3.5973 4.2200 3.3420 3.5093 3.1275 3.0964 1.1458 1.6024 1.5892 2.6564 4.2330 4.8669 2.1762 3.1547 4.8512 2.3207 2.8691 1.6721 1.7090 1.7124 1.4877 1.5696 1.5953 1.2390 1.1532 1.1578 1.2187 1.2284 1.3105 1.2261 1.3655 1.2611 1.3341 1.1578 1.0515 1.0413 1.0408 1.0652 1.0562 1.0497 1.0576 1.0835 1.0851 1.0353 1.0551 1.0615 1.0553 1.0969 1.0361 1.0365 1.1023 1.0935 1.1010 1.1067 1.0989 1.0989 1.1011 1.1012 1.0970
irintensity: 0.7989 0.1492 6.2203 2.5354 2.3658 5.9462 8.9065 2.2238 2.1448 2.2619 1.9277 2.7504 0.4335 4.6702 10.5813 1.8096 7.7709 1.9343 11.8941 3.5082 23.7594 6.2354 92.1822 13.5461 139.2877 24.8136 56.1055 207.5171 52.4476 48.7344 1.3554 15.3406 1.6360 10.9025 11.6961 26.1800 21.6799 2.7972 0.9164 15.4053 2.3510 2.5503 2.6392 1.5809 20.5860 25.7552 0.0851 11.6886 10.1959 9.9176 18.5662 6.4724 5.2740 12.2075 5.1969 0.5603 85.4380 32.6953 63.8994 49.1712 27.6910 30.2525 25.9259 65.9001 92.6778 22.2213 31.5103 36.6387 39.7146 38.9244 43.0149 31.0932
temp: 298.150 k
press: 1.00000 atm
elementType: 8 8 8 6 6 6 6 6 6 6 1 1 1 1 1 1 1 1 1 1 1 1 1 1 1 1
symmnumber: 1
zpe: 590568.3 jmol-1
zpe.correction: 0.224936 hartree
zpe.thermalcorrener: 0.238343 hartree
zpe.thermalcorrenthalpy: 0.239287 hartree
zpe.thermalcorrgfe: 0.184083 hartree
zpe.sumelectzpe: -501.108717 hartree
zpe.sumelectthermal: -501.095310 hartree
zpe.sumelectthermalent: -501.094366 hartree
zpe.sumelectthermalfe: -501.149570 hartree
dipole: 0.0595 -0.8055 1.4590
dipole: 1.6677
quadrupole: -53.9829 -59.5837 -63.9771
quadrupole: -2.6768 5.4818 3.2519
quadrupole: 5.1983 -0.4025 -4.7958 -2.6768 5.4818 3.2519
hfenergy: -501.3336526 hartree
pointgroup: C01 [X(C7H16O3)]
dipole: -0.0031839 -0.3179048 -0.5739341 debye
dipolederiv: -0.5865568 0.0588671 -0.033649 0.2621882 -1.2020483 0.1523847 0.0138295 0.2353828 -0.4510615 -1.4016198 0.3122606 -0.0565929 0.101467 -0.6037716 0.0252029 0.0166931 -0.1114096 -0.3993268 -1.0769684 -0.1246588 -0.0632173 -0.089061 -0.4341499 0.0147051 -0.0243522 0.0293246 -0.400599 1.0776677 -0.2131453 -0.0177037 -0.3187976 1.2336969 -0.0836069 -0.3018137 0.1938776 0.4121137 0.5506194 -0.0403434 -0.1293819 -0.156962 0.2206143 -0.0960382 -0.2414222 -0.1801224 0.2632764 0.419018 -0.0651343 0.018823 -0.0752212 0.5620288 -0.1641935 0.0718035 -0.362485 0.3830327 0.8146753 -0.1060847 0.1170214 0.0476839 0.342097 -0.0689013 0.2768908 -0.1305519 0.3547788 0.0536161 -0.0344182 -0.0008469 -0.0151484 -0.1240442 -0.0183639 -0.0108417 -0.0148761 0.065556 -0.1150915 0.0436334 0.0670722 0.0334848 0.0555201 -0.0117996 0.0586526 -0.0094348 0.0117302 0.6064277 0.140299 0.1089622 0.2149543 0.3895516 -0.0097518 0.2465091 0.0114867 0.3479366 0.0014572 0.0277607 -0.0286601 0.0136429 -0.0717204 0.0714088 0.0456294 0.0775502 -0.1367702 -0.0183334 0.0052185 0.004438 0.0268904 0.0496324 0.0974339 0.0877899 0.0711074 -0.1550242 -0.0142392 -0.033725 0.0190656 0.0689957 -0.2041644 -0.0126276 0.0466268 0.012792 0.0645588 -0.0086978 0.0347112 0.1096594 0.0391591 -0.0109174 -0.0627112 0.0683718 0.0147735 -0.1094408 -0.1623311 0.0025011 -0.1086717 -0.0280891 0.012325 -0.0022819 -0.0880018 0.0496179 -0.0062158 -0.008381 0.0004766 0.0013941 -0.0712091 -0.1320646 -0.0887684 -0.0554853 -0.0425458 0.0210976 -0.05127 -0.0141009 0.0395782 0.005374 -0.0183121 0.1383232 -0.0677778 0.127261 -0.1603988 0.0965763 0.0307511 -0.0431179 0.0243969 -0.0472142 0.1061617 -0.0416745 0.1483893 -0.0679135 0.0117247 0.0470668 0.1115062 0.0221321 0.0633284 -0.0375687 0.1033461 -0.0987286 -0.0335007 -0.1411863 -0.0624585 -0.0670765 -0.0112181 0.0789297 -0.0052698 -0.067072 -0.0451025 0.0784279 -0.1486569 -0.000502 -0.0900462 -0.0193901 0.1029479 -0.0225286 -0.1146662 -0.0183441 0.0297823 0.0991494 -0.0405742 -0.004193 0.0119915 -0.1352931 -0.0785703 0.0351434 -0.0689838 0.0676277 0.1069599 0.0083503 -0.007191 -0.0046703 0.0078108 0.1230552 0.0484928 0.1010443 -0.0768373 0.0122268 0.0261957 -0.0231266 -0.1109151 -0.2453694 -0.0048925 -0.0715631 -0.0042331 0.0601641 0.012503 -0.0316672 0.0120349 -0.0360981 0.029614 0.0838716 -0.1280325 0.0542787 -0.212471 -0.1292893 0.0287207 0.0639194 0.0644192 0.0809727 -0.0446729 0.0929241 -0.0400681 0.0494766 unknown
polarizability: 104.0002516|-1.3677928|90.4555868|1.4149751|-1.5757553|73.4055276 unknown
InChI: InChI=1S/C7H16O3/c1-4-9-7(6-8-3)10-5-2/h7H,4-6H2,1-3H3
charge 0 multiplicity 1
26 atoms
O  -0.022653 1.000631 0.69079
O  1.212093 -0.861133 -0.241066
O  -2.396391 -0.613824 0.289209
C  0.015676 -0.434308 0.487583
C  -1.139664 -1.025993 -0.331208
C  -0.263141 1.814158 -0.522349
C  2.461427 -0.663336 0.526086
C  0.015989 3.267527 -0.140937
C  3.622646 -1.063043 -0.382312
C  -3.551774 -1.188008 -0.396551
H  0.017785 -0.831805 1.522367
H  -1.080156 -0.678494 -1.385333
H  -1.036762 -2.131892 -0.327448
H  0.408346 1.474744 -1.337037
H  -1.317197 1.684171 -0.839746
H  2.53387 0.396576 0.83956
H  2.429495 -1.295558 1.440237
H  -0.178907 3.935863 -0.999987
H  -0.632887 3.575547 0.697052
H  1.067077 3.394875 0.171913
H  4.58419 -0.948963 0.151159
H  3.523032 -2.11447 -0.703462
H  3.645416 -0.427241 -1.284403
H  -3.536311 -2.298769 -0.363037
H  -3.598209 -0.866059 -1.459567
H  -4.441792 -0.818895 0.136589
