program: Gaussian 09
title: 000078559
version: EM64L-G09RevD.01
frameworkgroup: C1[X(C15H12N2O)]
method: RPBEPBE
basis: SDD
operation: Freq
keyword: #p
keyword: freq=noraman
keyword: PBEPBE/SDD
title: #p freq=noraman PBEPBE/SDD
converged: NO YES NO NO
title: Mulliken charges:
elementType: O N N C C C C C C C C C C C C C C C H H H H H H H H H H H H
charge: -0.221165 -0.279929 -0.064363 -0.662495 0.110331 0.164770 0.335769 0.415647 -0.356063 -0.359965 -0.351234 -0.379844 -0.243183 -0.227371 -0.221427 -0.203203 -0.230344 -0.248881 0.283150 0.283153 0.236922 0.265857 0.301122 0.274079 0.230872 0.232311 0.227052 0.225746 0.234195 0.228493
chargesum: 0.00000
title: Mulliken charges with hydrogens summed into heavy atoms:
elementType: O N N C C C C C C C C C C C C C C C
charge: -0.221165 -0.279929 -0.064363 -0.096192 0.110331 0.164770 0.335769 0.415647 -0.119141 -0.094108 -0.050111 -0.105766 -0.012312 0.004940 0.005625 0.022542 0.003851 -0.020388
polarizability: 3.26345326e+02 2.18461991e-01 1.90673242e+02 -6.05676443e-03 1.56714977e-02 7.08349307e+01
1716.lowfreq: -8.8572 -3.2888 -0.0009 0.0002 0.0007 5.3617 32.7740 41.9595 72.0762
frequency: 32.7498 41.9409 72.0700 73.7481 110.3936 172.5072 185.2451 238.8548 258.0372 303.1002 353.0892 365.5980 401.5072 409.4365 436.5140 443.3325 502.0311 536.5817 584.9510 597.0654 613.7780 614.2915 638.9448 668.8495 696.9273 700.1961 750.8413 770.1410 772.0140 853.2230 856.6047 874.4813 921.6132 932.3822 944.2245 945.4507 984.8617 986.0892 987.7891 988.4618 1000.5053 1004.1954 1011.9391 1028.4005 1035.7037 1054.8304 1086.7050 1100.7928 1118.4446 1133.1375 1172.4849 1174.8246 1188.9515 1191.4949 1220.1700 1302.1137 1320.8640 1326.3398 1377.0621 1384.3259 1386.4327 1407.4644 1437.8200 1448.3531 1485.0098 1488.3247 1526.3031 1585.0140 1591.9541 1612.3902 1614.1354 1641.6681 3019.5025 3074.0897 3127.5929 3129.6349 3135.1683 3140.9131 3147.3274 3159.6933 3161.9545 3171.0068 3189.1253 3192.0744
redmass: 3.6751 4.3614 7.2947 5.1064 4.0059 3.3118 5.4326 5.1504 6.3025 8.0510 5.3750 5.8797 2.8242 2.9664 2.6257 7.1049 3.0145 3.0609 4.7413 4.3753 6.4638 6.4421 8.0232 6.6399 1.7760 2.0742 7.3817 1.6469 1.7745 1.2531 1.2449 7.2589 1.6925 1.4190 2.0050 6.1897 1.3790 6.2223 6.0681 1.3513 1.2998 1.3336 3.9783 2.2229 2.2252 3.2788 1.6382 1.8173 1.1773 4.9859 1.0537 1.0574 1.1292 1.1256 1.6407 3.3859 1.5323 1.3615 3.6661 8.8623 6.0613 1.1491 2.3405 2.4064 2.3992 2.9291 6.2060 6.1260 6.6753 5.9943 5.9705 12.0159 1.0616 1.0998 1.0854 1.0854 1.0878 1.0910 1.0928 1.0960 1.0977 1.1011 1.0939 1.0960
irintensity: 0.0140 0.3695 0.0037 0.1686 4.2994 10.3698 2.2089 0.0702 0.7263 5.2782 0.6800 2.9929 0.0034 0.0110 0.7903 5.7020 15.3667 0.3428 12.5476 6.3104 0.9282 0.2802 39.6577 11.7067 36.5975 51.1553 4.5290 66.4834 72.7661 0.0568 0.0161 23.3392 4.6756 12.4012 0.2646 9.8399 0.1397 0.9672 1.1939 0.0033 2.4779 0.2550 22.8543 5.0405 21.7921 76.1792 10.7614 82.5281 2.0898 47.4833 0.4215 0.0169 8.8912 0.6397 9.8480 97.6680 37.4004 2.9542 39.1421 0.9288 10.4253 17.5459 16.1341 9.8720 139.1897 25.2804 2.7270 1.6078 0.2576 69.1165 1.2808 334.1600 0.8263 0.2630 5.5095 0.3334 1.0248 22.5606 21.6781 22.9205 34.7128 22.0588 1.7315 9.2598
temp: 298.150 k
press: 1.00000 atm
elementType: 8 7 7 6 6 6 6 6 6 6 6 6 6 6 6 6 6 6 1 1 1 1 1 1 1 1 1 1 1 1
symmnumber: 1
zpe: 608457.5 jmol-1
zpe.correction: 0.231749 hartree
zpe.thermalcorrener: 0.245874 hartree
zpe.thermalcorrenthalpy: 0.246818 hartree
zpe.thermalcorrgfe: 0.189337 hartree
zpe.sumelectzpe: -762.278724 hartree
zpe.sumelectthermal: -762.264600 hartree
zpe.sumelectthermalent: -762.263655 hartree
zpe.sumelectthermalfe: -762.321137 hartree
dipole: 3.3888 -1.1968 -0.0003
dipole: 3.5939
quadrupole: -86.0083 -100.6869 -109.7919
quadrupole: 7.8645 -0.0005 0.0021
quadrupole: 12.8207 -1.8578 -10.9629 7.8645 -0.0005 0.0021
hfenergy: -762.5104733 hartree
pointgroup: C01 [X(C15H12N2O1)]
dipole: -1.3317548 -0.4750895 0.0001145 debye
polarizability: 326.3453414|0.2135389|190.6732268|-0.0060068|-0.0156907|70.8349307 unknown
InChI: InChI=1S/C15H12N2O/c18-15-11-14(12-7-3-1-4-8-12)16-17(15)13-9-5-2-6-10-13/h1-10H,11H2
charge 0 multiplicity 1
30 atoms
O  1.58452 2.897093 -0.000288
N  1.083336 0.550473 -0.00017
N  -0.081416 -0.269995 -0.000078
C  -0.761267 1.990924 -0.000147
C  -1.147258 0.527906 -0.000085
C  0.772703 1.936352 -0.00025
C  -2.514997 -0.003235 -0.000014
C  2.366316 -0.085367 -0.000062
C  -3.628536 0.882416 -0.000001
C  -2.753158 -1.408594 0.000035
C  3.556211 0.690346 -0.000368
C  2.436123 -1.503262 0.000343
C  -4.94573 0.377685 0.000066
C  -4.068433 -1.907274 0.000096
C  4.805377 0.034077 -0.000269
C  3.694585 -2.137417 0.000444
C  -5.171795 -1.017595 0.000113
C  4.886936 -1.376527 0.00013
H  -1.123353 2.537714 -0.889161
H  -1.123222 2.537719 0.888922
H  -3.465916 1.966353 -0.000034
H  -1.894407 -2.087194 0.000022
H  3.494761 1.780186 -0.000641
H  1.510199 -2.081834 0.000569
H  -5.794257 1.070484 0.000079
H  -4.239293 -2.98935 0.000129
H  5.720274 0.637115 -0.000512
H  3.741727 -3.232202 0.000769
H  -6.194863 -1.408983 0.000165
H  5.861934 -1.875213 0.0002
