program: Gaussian 09
title: 000078647
version: EM64L-G09RevD.01
frameworkgroup: C1[X(C13H15O5PS)]
method: RPBEPBE
basis: SDD
operation: Freq
keyword: #p
keyword: freq=noraman
keyword: PBEPBE/SDD
title: #p freq=noraman PBEPBE/SDD
converged: NO YES NO NO
title: Mulliken charges:
elementType: S P O O O O O C C C C C C C C C C C C C H H H H H H H H H H H H H H H
charge: -0.230339 0.888552 -0.458330 -0.240670 -0.471905 -0.475894 -0.211514 0.378544 0.218278 0.177811 -0.354795 -0.372986 0.123082 -0.335036 -0.233014 -0.213184 -0.247067 -0.206008 -0.657647 -0.655596 0.275409 0.243595 0.268376 0.225456 0.280771 0.220764 0.234330 0.237459 0.239583 0.213293 0.237076 0.222059 0.209069 0.237182 0.233298
chargesum: 0.00000
title: Mulliken charges with hydrogens summed into heavy atoms:
elementType: S P O O O O O C C C C C C C C C C C C C
charge: -0.230339 0.888552 -0.458330 -0.240670 -0.471905 -0.475894 -0.211514 0.378544 0.218278 0.177811 -0.079386 -0.129392 0.123082 -0.066660 0.273212 0.241910 -0.009608 0.033575 0.014781 0.023952
polarizability: 3.23598382e+02 -2.25067625e+01 1.98998573e+02 1.24246031e+01 7.40640439e+00 1.34999240e+02
1716.lowfreq: -23.6612 -11.1732 -0.0023 -0.0015 0.0010 5.9097 6.9110 22.9388 24.1837
frequency: -22.3608 22.4028 24.0778 45.8949 48.0605 63.9792 86.4286 91.6320 100.3113 112.5527 128.8568 172.5151 192.0481 220.8803 235.6386 244.2319 255.0430 266.1948 286.7783 294.3341 321.3122 329.7058 359.8531 411.7374 427.8240 432.8340 449.0718 474.1340 510.2160 551.6019 566.7629 584.6063 613.0575 690.7716 698.2873 712.8134 716.1481 725.6194 742.0753 765.4526 807.1183 812.9958 844.4214 866.2308 868.4412 883.6577 893.4683 921.8999 956.3488 988.9529 992.4009 1011.9369 1023.4223 1025.8981 1103.2609 1106.3014 1110.5951 1133.8156 1138.3531 1141.9608 1173.9616 1197.3001 1251.5605 1254.8653 1255.3560 1277.3613 1348.5065 1357.2430 1358.1100 1393.3482 1394.3351 1402.6425 1438.7349 1457.2277 1458.1765 1477.5375 1478.2607 1479.7932 1487.6647 1494.8799 1562.2835 1609.9262 1617.7257 1661.4763 2986.5874 2993.5859 2997.0054 3008.2654 3056.9357 3087.0566 3093.6538 3095.7754 3112.3668 3117.3555 3137.0343 3149.1807 3162.2712 3167.2803 3181.2751
redmass: 2.5542 5.6643 4.6138 4.9890 3.5266 2.1080 4.7531 3.4130 5.7849 6.6163 5.3749 6.1894 5.2068 2.2558 4.8952 1.2737 1.7692 5.5502 4.1749 4.8541 5.3956 10.1993 4.9205 6.1978 7.0222 8.4021 4.2274 5.0356 7.9889 3.5996 7.9429 9.4490 9.3017 6.9849 7.7618 7.4642 7.9227 7.9741 4.0888 1.2445 1.0883 1.0894 5.2808 1.3812 4.8605 4.1763 6.7214 1.4300 1.4031 1.3324 7.1803 2.4074 2.4312 2.4079 2.2497 2.2448 1.8332 1.4158 1.4586 2.7400 1.1133 2.2471 1.1413 1.4772 1.5720 1.8455 2.2981 1.2589 1.2484 1.2465 1.2440 8.3624 2.5744 1.0397 1.0403 1.0556 3.0105 1.0489 1.0790 1.0838 6.7658 7.2998 7.3871 12.0375 1.0562 1.0357 1.0376 1.0631 1.1068 1.1003 1.0980 1.0984 1.1022 1.1037 1.0873 1.0904 1.0931 1.0957 1.0990
irintensity: 0.6496 2.1976 1.5508 1.7536 0.6877 3.5121 1.0596 1.1992 1.4444 1.8617 1.5463 0.1234 17.8616 4.9716 3.2033 2.2971 4.8837 1.8931 10.5008 4.0185 4.1468 8.4461 2.6156 12.6068 23.4669 13.2980 1.3384 6.4688 11.9970 1.7225 3.8216 71.2621 60.7358 66.6006 108.4901 72.0164 21.2953 57.6168 4.9218 82.3599 1.7027 3.6906 5.3118 5.1015 181.4788 232.3393 9.0158 18.7486 10.3369 0.3533 363.6556 113.5261 96.2762 4.0777 6.6963 17.2773 15.4183 3.9640 2.3767 53.2923 0.3212 14.0974 4.4022 47.8314 42.8305 97.1907 1.9587 2.8513 11.3374 22.2199 28.0804 7.2040 44.5191 12.5025 11.6439 6.0119 2.7046 7.2152 11.2032 11.5409 2.5764 159.3047 23.9341 435.1004 27.6250 23.9628 26.1634 25.0097 11.9545 18.1536 26.8276 18.4302 30.9822 21.0692 0.9750 7.9103 6.5725 16.5996 11.4316
temp: 298.150 k
press: 1.00000 atm
elementType: 16 15 8 8 8 8 8 6 6 6 6 6 6 6 6 6 6 6 6 6 1 1 1 1 1 1 1 1 1 1 1 1 1 1 1
symmnumber: 1
zpe: 680921.2 jmol-1
zpe.correction: 0.259349 hartree
zpe.thermalcorrener: 0.279801 hartree
zpe.thermalcorrenthalpy: 0.280745 hartree
zpe.thermalcorrgfe: 0.207918 hartree
zpe.sumelectzpe: -1618.299906 hartree
zpe.sumelectthermal: -1618.279455 hartree
zpe.sumelectthermalent: -1618.278511 hartree
zpe.sumelectthermalfe: -1618.351338 hartree
dipole: 1.4263 -2.2961 -0.3885
dipole: 2.7308
quadrupole: -91.3006 -124.1686 -141.6038
quadrupole: -5.3837 -0.4729 1.0386
quadrupole: 27.7237 -5.1443 -22.5794 -5.3837 -0.4729 1.0386
hfenergy: -1618.5592557 hartree
pointgroup: C01 [X(C13H15O5P1S1)]
dipole: -0.707489 -0.7725501 0.238489 debye
polarizability: 327.623444|1.1076736|192.4102293|10.1386137|-15.5305833|137.5625215 unknown
InChI: InChI=1S/C13H15O5PS/c1-3-15-19(20,16-4-2)18-12-9-10-7-5-6-8-11(10)17-13(12)14/h5-9H,3-4H2,1-2H3
charge 0 multiplicity 1
35 atoms
S  1.777981 -0.822135 -2.268177
P  2.178988 -0.842129 -0.245734
O  0.787394 -0.714643 0.858255
O  -1.829019 1.684493 -0.280746
O  3.376497 0.235354 0.350882
O  2.72701 -2.288376 0.501661
O  0.445171 1.976863 -0.074941
C  -2.880009 -0.484499 0.222303
C  -0.450484 -0.222489 0.441965
C  -2.975781 0.879773 -0.182419
C  -1.571426 -1.01818 0.52474
C  -4.080472 -1.24795 0.301416
C  -0.51794 1.192396 0.027227
C  -4.210597 1.479323 -0.498805
C  3.596228 1.568298 -0.309834
C  4.05213 -2.82993 0.061979
C  -5.317832 -0.662634 -0.013458
C  -5.38167 0.70074 -0.412772
C  4.825634 2.163347 0.367934
C  4.209259 -4.168566 0.775034
H  -1.458188 -2.061869 0.835486
H  -4.023339 -2.297855 0.61018
H  -4.233343 2.52895 -0.804607
H  3.752558 1.397739 -1.391888
H  2.689565 2.175602 -0.161076
H  4.044703 -2.946197 -1.039657
H  4.837926 -2.108674 0.352014
H  -6.236066 -1.255037 0.048038
H  -6.348535 1.152673 -0.657138
H  5.03861 3.156211 -0.070075
H  4.651901 2.290665 1.449645
H  5.712042 1.521437 0.225547
H  5.180756 -4.622963 0.505956
H  4.177616 -4.031029 1.86891
H  3.403131 -4.863006 0.484755
